{"text_format":"1","workbook":"xlsx","n_sheets":15,"sheets":["Design Regulator","Input Filters","Design Input Filter","BOM & Schematic","EVM","Variable Management","Schematic Management","Stability Calculations","Bode Plot Management","Efficiency Calculations","Efficiency Plot Management","Input Filter Calculations","Standard Value Calculator","Snubber","Parallel Output Caps"],"not_rendered":{"charts":9,"images":28,"macros":1,"external_links":0,"defined_names":304,"comments":3,"pivot_tables":0},"unopened":[],"bounds":{"document_bytes":16777216,"sheet_cells":100000,"rows_first":2000,"rows_last":500,"rows_between":2000,"halvings":0,"cell_chars":16384,"cell_head_chars":4096},"cells_cut":0,"cells_raw":0,"read":"whole","date_system":"1900"}

{"sheet":"Design Regulator","index":0,"n_rows":104,"n_cols":16,"rows_kept":104,"cut":false,"hidden":false,"merged":[[69,5,69,7],[2,13,2,14],[0,0,0,15],[80,5,80,6],[34,10,35,15]]}
["                      LM(2)5148/-Q1 Synchronous Buck Controller Design Tool"]
[null,null,null,null,null,null,null,null,null,null,null,null,null,"http://www.ti.com/product/lm5175"]
["About",null,"xx",null,null,"= Input Box",null,null,null,null,null,null,null,"TERMS OF USE",null,"                "]
[]
["Step 1: Operating Specifications"]
[null,null,null,"Input Voltage – Min, VIN(min) ",24,"V"]
[null,null,null,"Input Voltage – Nom, VIN(nom)",24,"V"]
[null,null,null,"Input Voltage – Max, VIN(max)",24,"V"]
[null,null,null,"Output Voltage, VOUT ",19,"V"]
[null,null,null,"Full Load Output Current, IOUT ",13,"A"]
[null,null,null,"Switching Frequency, FSW",425,"kHz"]
[null,null,null,"Frequency Set Resistor, RT ",{"$f":"'Variable Management'!C443","v":51.1},"kΩ"]
[null,null,null,"Ambient Temperature, TA",30,"°C"]
[]
["Step 2: Current Sense Resistor"]
[null,null,null,"Required IOCP Setpoint at VIN(nom)",18.2,"A"]
[null,null,null,"Recommended Shunt Resistance",{"$f":"Rs_ideal*1000","v":3.1258523807682499},"mΩ"]
[null,null,null,"Shunt Resistance, RS",3,"mΩ"]
[null,null,null,"Min Inductor Sat Current, ILO(SAT)",{"$f":"'Variable Management'!B95","v":20},"A"]
[null,null,null,"Max Power Loss in Shunt",{"$f":"'Variable Management'!B105","v":1.0845864967752621},"W"]
[null,null,null,"VIN(min)",{"$f":"'Variable Management'!B97","v":19.005235599368383},"A"]
[null,null,"IOUT(typ) at OCP Inception:","VIN(nom)",{"$f":"'Variable Management'!B98","v":19.005235599368383},"A"]
[null,null,null,"VIN(max)",{"$f":"'Variable Management'!B99","v":19.005235599368383},"A"]
[]
["Step 3: Buck Inductance"]
[null,null,null,"Inductance for Ideal Slope Comp",{"$f":"Lopt*1000000","v":5.9030654515327257},"µH"]
[null,null,null,"Inductance, LO ",4.7,"µH"]
[null,null,null,"Inductor DCR ",5.2,"mΩ"]
[null,null,null,"DIL as a % at VIN(nom)",{"$f":"'Variable Management'!B68*100","v":15.3040677020249},"%"]
[null,null,null,"Estimate Core Loss at VIN(nom)",0.2,"W"]
[]
["Step 4: Output Capacitors"]
[null,null,null,"Output Voltage Ripple Spec",140,"mVPK=PK"]
[null,null,null,"Minimum Output Capacitance",{"$f":"'Variable Management'!B121","v":4.1796823555950349},"µF"]
[null,null,null,"Output Capacitance (derated), COUT ",60,"µF",null,null,null,null,{"$f":"CHOOSE(SCH_MODE, \"\", \"** For Single-Output Operation in 2-Phase Mode, tie MODE to VDDA and use FB1 to set VOUT **\", \"** For Single-Output Operation in 3-Phase Mode, tie both MODE pins to VDDA. Use FB1 of master IC to set VOUT. Connect FB2 of master IC to AGND. Connect FB2 of slave IC to VDDA to configure it as a slave **\", \"** For Single-Output Operation in 4-Phase Mode, tie both MODE pins to VDDA. Use FB1 of master IC to set VOUT. Connect FB2 of master IC to AGND. Connect FB2 of slave IC to VDDA to configure it as a slave **\")","v":""}]
[null,null,null,"Maximum Permitted ESR",{"$f":"'Variable Management'!B125","v":70.197474561212374},"mΩ"]
[null,null,null,"Output Capacitor ESR",66.3,"mΩ",null,null,null,null,{"$f":"CHOOSE(SCH_MODE,  \"\", \"** Tie VCCX to GND if not used **\", \"** Slave controller (CNTRL2) not shown **\",\"** Slave controller (CNTRL2) not shown **\")","v":""},null,null,null,null,{"$f":"IF(SCH_MODE=1,  \"** Tie VCCX to GND if not used **\", \"\")","v":"** Tie VCCX to GND if not used **"}]
[null,null,null,"Resulting Output Voltage Ripple (max) ",{"$f":"'Variable Management'!B127*1000","v":132.26580226739236},"mVPK-PK",null,null,null,null,{"$f":"IF(OR(SCH_MODE=3, SCH_MODE=4),\"** Tie VCCX to GND if not used **\", \"\")","v":""}]
[null,null,null,"Output Capacitor RMS Current (max) ",{"$f":"'Variable Management'!B114","v":0.57432749448492171},"ARMS"]
[]
["Step 5: Input Capacitors"]
[null,null,null,"Input Voltage Ripple Spec",900,"mVPK-PK"]
[null,null,null,"Minimum Input Capacitance",{"$f":"'Variable Management'!B148","v":8.4967320261437909},"µF"]
[null,null,null,"Input Capacitance (derated), CIN ",120,"µF"]
[null,null,null,"Maximum Permitted ESR",{"$f":"'Variable Management'!B155","v":59.756240681420721},"mΩ",null,null,null,null,null,null,null,null,null," "]
[null,null,null,"Input Capacitor ESR",133,"mΩ"]
[null,null,null,"Resulting Input Voltage Ripple (max)",{"$f":"'Variable Management'!B162*1000","v":1925.0291554800838},"mVPK-PK"]
[null,null,null,"Input Capacitor RMS Current (max)",{"$f":"'Variable Management'!B138","v":6.5},"ARMS"]
[null,null,null,"AEF Filter Inductor",0.68,"µH"]
["Step 6: Precision Enable, DRSS, FPWM / PFM"]
[]
[]
[null,null,null,"Input Voltage UVLO Turn On",12,"V"]
[null,null,null,"Input Voltage UVLO Turn Off",11,"V"]
[null,null,null,"Upper Enable Resistor, RUV1",{"$f":"IF(UVLO_TYPE=1,'Variable Management'!B188,0)","v":100},"kΩ"]
[null,null,null,"Lower Enable Resistor, RUV2",{"$f":"IF(UVLO_TYPE=1,'Variable Management'!B189,\"DNP\")","v":9.09},"kΩ"]
[null,null,null,"Configuration Resistor, RCNFG",{"$f":"IF(DITHER=1,\"41.2\",\"29.4\")","v":"41.2"},"kΩ"]
[null,null,null,{"$f":"IF(DEMB=1, \"* Tie PFM to GND\", \"* Tie PFM to VDDA\")","v":"* Tie PFM to GND"}]
[]
["Step 7: Compensation Design"]
[null,null,null,"Load Pole Frequency",{"$f":"Fp_dominant","v":2248.0671813831877},"Hz"]
[null,null,null,"ESR Zero Frequency",{"$f":"Fesr/1000","v":40.008784131160482},"kHz"]
[null,null,null,"Desired Crossover Frequency",65,{"$f":"\"     kHz \"","v":"     kHz "}]
[null,null,null,"Error Amp Pole Frequency",{"$f":"Fp1_u","v":3.0312855381479173},"Hz"]
[null,null,null,{"$f":"CHOOSE(VOUT_setting, \"Upper Feedback Resistor\",\"\",\"\",\"\")","v":"Upper Feedback Resistor"},287,"kΩ"]
[null,null,null,{"$f":"CHOOSE(VOUT_setting, \"Lower Feedback Resistor\", \"* Connect \"&'Variable Management'!D419&\" from FB to VDDA\",\"* Tie FB to VDDA\",\"* Connect \"&'Variable Management'!D419&\" from FB to VDDA\")","v":"Lower Feedback Resistor"},{"$f":"IF(Vout=Vref,\"OPEN\",Rfb2_u/1000)","v":12.7},{"$f":"IF(Vout=Vref,\"\",\"kΩ\")","v":"kΩ"}]
[null,null,null,{"$f":"CHOOSE(VOUT_setting, \"Actual Output Voltage Setpoint\",\"\",\"\",\"\")","v":"Actual Output Voltage Setpoint"},{"$f":"0.8/E66*(E65+E66)","v":18.878740157480319},"V"]
[]
["Compensation Components"]
[null,"Calculated /","Std Values",{"$f":"C70","v":"Std Values"},null,"Actual P/Z Frequencies"]
["RC1",{"$f":"Rcea1/1000","v":14.549500960312502},{"$f":"'Standard Value Calculator'!S32","v":14.7},29.4,"kΩ",{"$f":"Fp1_u","v":3.0312855381479173},"Hz   (FPEA)"]
["CC1",{"$f":"Cc1ea*1000000000","v":1.6829014242523066},{"$f":"'Standard Value Calculator'!S33","v":1.8},0.82,"nF",{"$f":"Fz1_u/1000","v":6.6017481032751109},"kHz (FZCOMP)"]
["CC2",{"$f":"IF(Cc2ea<0, \"N/A\", Cc2ea*1000000000000)","v":241.58045073763861},{"$f":"'Standard Value Calculator'!S34","v":220},18,"pF",{"$f":"Fp2_u/1000","v":108.63588282769165},"kHz (FPCOMP)"]
[]
[]
["Efficiency / Power Loss Analyzer"]
[]
["Step 8: Efficiency"]
[null,null,null,null,null,"Power MOSFETs","(Q1, Q2) "]
[null,null,null,null,"'852, '824"]
[null,null,null,null,"High-side","  Low-side"]
[null,null,null,"On-State Resistance, RDS(on) ",12,4.0999999999999996,"mΩ"]
[null,null,null,"Total Gate Charge, QG ",8,25,"nC"]
[null,null,null,"Gate-Drain Charge, QGD ",2.9,9,"nC"]
[null,null,null,"Gate-Source Charge, QGS ",3.1,8.6999999999999993,"nC"]
[null,null,null,"Output Charge, QOSS ",null,30,"nC"]
[null,null,null,"Output Capacitance, COSS ",116,366,"pF"]
[null,null,null,"Gate Resistance, RG ",1.2,1.2,"Ω"]
[null,null,null,"Transconductance, gFS ",55,178,"S"]
[null,null,null,"Gate-Source Threshold Voltage, VTH ",3.1,3,"V"]
[null,null,null,"Body Diode Forward Voltage, VBD ",0.7,0.7,"V"]
[null,null,null,"Body Diode Rev Recovery Charge, QRR ",null,59,"nC"]
[null,null,null,"Thermal Resistance, θJA ",42,40.700000000000003,"°C/W"]
[]
["External Schottky Diode (if applicable)"]
[null,null,null,"Schottky Fwd Voltage, VFWDsch ",null,0,"V"]
[null,null,null,"Schottky Rev Recovery Charge, QRRsch ",null,0,"nC"]
[]
[]
[]
["Step 9: IC Power Loss"]
[null,null,null,"IC Power Dissipation",{"$f":"'Variable Management'!B362","v":7.0124999999999993E-2},"W"]
[null,null,null,"IC Junction Temperature (estimate)",{"$f":"'Variable Management'!B364","v":32.391262499999996},"°C"]
[null,null,null,null,{"$f":"CHOOSE(Ext_VCC, \"\", \"* Tie VCCX to PGND\")","v":""}]

{"sheet":"Input Filters","index":1,"n_rows":17,"n_cols":17,"rows_kept":17,"cut":false,"hidden":true,"merged":[[0,0,0,16],[2,14,2,15]]}
["                           LM(2)5149-Q1 Synchronous Buck Controller Design Tool"]
[null,null,null,null,null,null,null,null,null,null,null,null,null,null,"http://www.ti.com/product/lm5175"]
["About",null,"xx",null,null,"= Input Box",null,null,null,null,null,null,null,null,"TERMS OF USE",null,"                "]
[]
[]
[]
[null,null,null,null,"AEF",null,null,null,null,null,null,null,"Passive"]
[]
[null,"Design tab - LAEF",{"$f":"'Design Regulator'!E49 & \" µH\"","v":"0,68 µH"},null,null,"LAEF",1,"µH",null,"Suggested LIN Inductor","0.1-10","µH",null,"Chosen LIN",0.68,"µH"]
[null,"Design tab - CINJ",{"$f":"'Design Regulator'!#REF! & \" µF\"","v":{"$error":"#REF!"}},null,null,"CINJ",1,"µF",null,"Suggested CF","0.1-10","µF",null,"Chosen CF",0.47,"µF"]
[null,"Design tab - CDAMP",{"$f":"'Design Regulator'!#REF! & \" µF\"","v":{"$error":"#REF!"}},null,null,"CDAMP",1,"µF",null,"Suggested CDAMP","1-10","µF",null,"Chosen CDAMP",1,"µF"]
[null,"Design tab - RDAMP",{"$f":"'Design Regulator'!#REF! & \" Ω\"","v":{"$error":"#REF!"}},null,null,"RDAMP",10,"Ω",null,"Suggested RDAMP",{"$f":"Rdamp_PassiveStd","v":{"$error":"#VALUE!"}},"Ω",null,"Chosen RDAMP",0.35,"Ω"]
[]
[null,null,"VIN Ripple at Fsw",null,null,{"$f":"VinRipple_dBuV","v":125.68874622980708},"dBµV","VIN Ripple",{"$f":"VinRipple_dBuV","v":125.68874622980708},"dBµV"]
[]
[null,null,null,"AEF Attenuation at Fsw",{"$f":"-'Input Filter Calculations'!AM97","v":{"$error":"#VALUE!"}},"dB",null,null,null,null,null,"Passive Attenuation at Fsw",{"$f":"-'Input Filter Calculations'!AA97","v":13.181892753626096},"dB"]
[null,null,null,"AEF EMI at Fsw",{"$f":"VinRipple_dBuV-E16","v":{"$error":"#VALUE!"}},"dB-µV",null,null,null,null,null,"Passive EMI at Fsw",{"$f":"VinRipple_dBuV-M16","v":112.50685347618098},"dB-µV"]

{"sheet":"Design Input Filter","index":2,"n_rows":14,"n_cols":17,"rows_kept":14,"cut":false,"hidden":true,"merged":[[0,0,0,16],[2,14,2,15]]}
["                           LM5149-Q1 Synchronous Buck Controller Design Tool"]
[null,null,null,null,null,null,null,null,null,null,null,null,null,null,"http://www.ti.com/product/lm5175"]
["About",null,"xx",null,null,"= Input Box",null,null,null,null,null,null,null,null,"TERMS OF USE",null,"                "]
[]
[]
[]
[null,"Choose Filter"]
[null,"Suggested Inductor",{"$f":"CHOOSE(INFILTER_TYPE,\"\",\"0.01-1\",\"0.1-10\")","v":""},"µH",null,"Chosen Inductor",1,"µH"]
[null,{"$f":"CHOOSE(INFILTER_TYPE,\"\",\"Suggested Cinj\",\"Suggested Cf\")","v":""},{"$f":"CHOOSE(INFILTER_TYPE,\"\",'Standard Value Calculator'!S24,'Standard Value Calculator'!S23)","v":""},"µF",null,{"$f":"CHOOSE(INFILTER_TYPE,\"\",\"Chosen Cinj\",\"Chosen Cf\")","v":""},6.8000000000000005E-2,"µF"]
[null,"Suggested Cdamp",{"$f":"CHOOSE(INFILTER_TYPE,\"\",CHOOSE(OSC,\"DNP\",'Standard Value Calculator'!S25),'Standard Value Calculator'!S28)","v":""},"µF",null,"Chosen Cdamp",3.3000000000000002E-2,"µF"]
[null,"Suggested Rdamp",{"$f":"CHOOSE(INFILTER_TYPE,\"\",'Standard Value Calculator'!S26,Rdamp_PassiveStd)","v":""},"Ω",null,"Chosen Rdamp",43.2,"Ω"]
[null,null,null,null,null,"Filter Attenuation",{"$f":"-'Variable Management'!B303","v":0},"dB"]
[null,null,null,null,null,"VIN Ripple",{"$f":"VinRipple_dBuV","v":125.68874622980708},"dB-µV"]
[null,null,null,null,null,"Fsw Conducted EMC",{"$f":"'Variable Management'!B304","v":125.68874622980708},"dB-µV"]

{"sheet":"BOM & Schematic","index":3,"n_rows":61,"n_cols":10,"rows_kept":61,"cut":false,"hidden":false,"merged":[[54,3,54,6],[53,3,53,6],[47,3,47,6],[55,0,56,0],[55,9,56,9],[55,3,56,6],[55,2,56,2],[55,1,56,1],[55,7,56,7],[55,8,56,8],[37,3,37,6],[52,3,52,6],[50,3,50,6],[51,3,51,6],[46,3,46,6],[49,3,49,6],[48,3,48,6],[45,3,45,6],[38,3,38,5],[39,3,39,5],[42,3,42,5],[44,3,44,5],[40,3,40,5],[43,3,43,5],[41,3,41,5]]}
[]
[]
[]
[]
[]
[]
[]
[]
[]
[]
[]
[]
[]
[]
[]
[]
[]
[]
[]
[]
[]
[]
[]
[]
[]
[]
[]
[]
[]
[]
[]
[]
[null,null,null,null,null,null,null,null,{"$f":"IF(OR(SCH_MODE=3, SCH_MODE=4),\"** Tie VCCX to GND if not used **\", \"\")","v":""}]
["   ** Tie PFM to VDDA for PFM, AGND for FPWM **"]
["   ** Tie VCCX to GND if not used **"]
[{"$f":"\"Vin = \"&VIN_min&\"V to \"&VIN_max&\"V, Vout = \"& Vout &\"V, Iout = \" &Iout & \"A, Fsw = \" & Fsw/1000 &\"kHz, Current Limit = \"&ROUNDUP(Ilimit_DC,0)&\"A\"","v":"Vin = 24V to 24V, Vout = 19V, Iout = 13A, Fsw = 425kHz, Current Limit = 19A"}]
["High-Efficiency Synchronous Buck Regulator BOM"]
["Count","Ref Des","Value","Description",null,null,null,"Size","Part Number","MFR"]
[1,"CBOOT",0.1,{"$f":"C39","v":0.1},null,null,null,"0603","Std","Std"]
[1,"CCOMP",{"$f":"'Design Regulator'!D72","v":0.82},0.82,null,null,null,"0603","Std","Std"]
[1,"CHF",{"$f":"'Design Regulator'!D73","v":18},18,null,null,null,"0603","Std","Std"]
[{"$f":"ROUNDUP('Design Regulator'!E44/10,0)","v":12},"CIN",10,{"$f":"C42","v":10},null,null,null,1210,"Std","Std"]
[{"$f":"ROUNDUP('Design Regulator'!E35/47,0)","v":2},"COUT",47,{"$f":"C43","v":47},null,null,null,1210,"Std","Std"]
[2,"CVCC, CVCCX",2.2000000000000002,2.2000000000000002,null,null,null,"0603","Std","Std"]
[1,"CVDDA",0.47,0.47,null,null,null,"0603","Std","Std"]
[1,"LO",{"$f":"'Design Regulator'!E27","v":4.7},{"$f":"\"Inductor, \"&Lf*1000000&\"µH, \"&Rdcr*1000&\"mΩ, >\"&ROUNDUP(Ilimit_DC*1.1,0)&\"A\"","v":"Inductor, 4,7µH, 5,2mΩ, >21A"},null,null,null,"-","-","Various"]
[2,"Q1, Q2","See description",{"$f":"'Design Regulator'!E82","v":12},null,null,null,"Std",{"$f":"'Design Regulator'!E80","v":"'852, '824"},"-"]
[1,"RCOMP",{"$f":"'Design Regulator'!D71","v":29.4},{"$f":"C48","v":29.4},null,null,null,"0603","Std","Std"]
[1,"RS",{"$f":"Rs*1000","v":3},3,null,null,null,"0508","Std","Std"]
[1,"RT",{"$f":"'Design Regulator'!E12","v":51.1},51.1,null,null,null,"0603","Std","Std"]
[1,"RFB1",{"$f":"'Design Regulator'!E65","v":287},{"$f":"C51","v":287},null,null,null,"0603","Std","Std"]
[1,"RFB2",{"$f":"'Design Regulator'!E66","v":12.7},{"$f":"C52","v":12.7},null,null,null,"0603","Std","Std"]
[1,"RPG",100,100,null,null,null,"0603","Std","Std"]
[1,"RCS",100,100,null,null,null,"0603","Std","Std"]
[1,"RVIN",2.2000000000000002,2.2000000000000002,null,null,null,"0603","Std","Std"]
[1,"U1",{"$f":"'Variable Management'!P29","v":"LM5148"},{"$f":"CHOOSE(VARIANT, \"IC, LM5148, Synchronous Buck PWM Controller, 3.5V–80V Input\", \"IC, LM5148-Q1, Synchronous Buck PWM Controller, 3.5V–80V Input\", \"IC, LM25148, Synchronous Buck PWM Controller, 3.5V–42V Input\",  \"IC, LM25148-Q1, Synchronous Buck PWM Controller, 3.5V–42V Input\")","v":"IC, LM5148, Synchronous Buck PWM Controller, 3.5V–80V Input"},null,null,null,"VQFN-24",{"$f":"CHOOSE(VARIANT, \"LM5148RGYR\", \"LM5148QRGYRQ1\", \"LM25148RGYR\", \"LM25148QRGYRQ1\")","v":"LM5148RGYR"},"TI"]
[]
[]
["NOTES:"]
["** Inductor saturation current should be higher than the peak inductor current at the OCP setpoint for all input voltages and operating temperatures **"]
["** Effective input and output capacitances should be appropriately derated for applied voltage and temperature, particularly with ceramics **"]

{"sheet":"EVM","index":4,"n_rows":6,"n_cols":2,"rows_kept":6,"cut":false,"hidden":false,"merged":[[0,0,0,16]]}
[" LM25149-Q1 Quickstart Design Tool"]
[]
[]
[]
[]
[null,"LM25149-Q1EVM-2100 PCB Layout"]

{"sheet":"Variable Management","index":5,"n_rows":452,"n_cols":27,"rows_kept":452,"cut":false,"hidden":true,"merged":[[4,4,4,7],[0,0,0,8]]}
["EXCEL Variables Names/Calculations"]
[null,"Input from user ="]
[null,"Output ="]
[null,"Constant"]
["Variable Name","Value","STD Units",null,"Notes",null,null,null,"Iteration"]
["Step 1: Operational Specs"]
["VIN_min",{"$f":"'Design Regulator'!E6","v":24},"V","Minimum input voltage",null,null,null,null,1]
["VIN_nom",{"$f":"'Design Regulator'!E7","v":24},"V","Nominal input voltage",null,null,null,null,null,null,{"$f":"CHOOSE(SCH_MODE, \"Efficiency vs. IOUT (Ch1)\", \"Efficiency vs. IOUT - 2 Ph\", \"Efficiency vs. IOUT - 3 Ph\", \"Efficiency vs. IOUT - 4 Ph\")","v":"Efficiency vs. IOUT (Ch1)"},1,null,"DRSS Enabled",1,null,null,null,null,"Dual  Outputs",1,null,"FPWM",1,null,{"$f":"CHOOSE(SCH_MODE, \"Bode Plot (Ch1)\", \"Bode Plot - 2 Ph\", \"Bode Plot - 3 Ph\", \"Bode Plot - 4 Ph\")","v":"Bode Plot (Ch1)"},1]
["VIN_max",{"$f":"'Design Regulator'!E8","v":24},"V","Maximum input voltage",null,null,null,null,null,null,{"$f":"IF(MODE=1, \"Efficiency vs. IOUT (Ch2)\", \"N/A - Do Not Use\")","v":"Efficiency vs. IOUT (Ch2)"},2,null,"DRSS Disabled",2,null,null,null,null,"Single Output – 2  Phases",2,null,"PFM",2,null,{"$f":"IF(MODE=1, \"AEF Gain\", \"N/A - Do Not Use\")","v":"AEF Gain"},2]
[null,null,null,null,null,null,null,null,null,null,"PLOT_TYPE",1,null,"DRSS Yes/No",1,"1 = Yes, 2 = No",null,null,null,"Single Output – 3  Phases",3,null,"FPWM/PFM",1,null,"BODE_PLOT_TYPE",1]
["Vout",{"$f":"'Design Regulator'!E9","v":19},"V","Output voltage - channel 1",null,null,null,null,null,null,null,null,null,null,null,null,null,null,null,"Single Output – 4  Phases",4]
["Iout",{"$f":"'Design Regulator'!E10","v":13},"A","Output current - channel 1",null,null,null,null,1,null,null,null,null,null,null,null,null,null,null,"Single/Dual Yes/No",1]
[null,null,null,null,null,null,null,null,1,null,"Adjustable",1,null,"3.3V",1,null,null,null,null,"MODE (Single/Dual), DUAL = 1, SINGLE = 2",{"$f":"IF(U12=1, 1, 2)","v":1},null,"VCCX Connected",1]
["Rout",{"$f":"Vout/Iout","v":1.4615384615384615},"W","Load resistance - Channel 1",null,null,null,null,null,null,"5V",2,null,"5V",2,null,null,null,null,"SINGLE OUTPUT (1 = YES)",{"$f":"IF(U12=1, 2, 1)","v":2},null,"No External VCC",2]
[null,null,null,null,null,null,null,null,null,null,"3.3V",3,null,"Adjustable",3,null,null,null,null,"Number of Phases",{"$f":"SCH_MODE","v":1},null,"Ext_VCC",1]
["Pout",{"$f":"Vout*Iout","v":247},"W","Output power",null,null,null,null,null,null,"12V",4,null,"Output Setting",{"$f":"IF(Vout2=3.3, 1, IF(Vout2=5, 2, 3))","v":3}]
[null,null,null,null,null,null,null,null,null,null,"Output Voltage Setting",{"$f":"IF(Vout=3.3, 3, IF(Vout=5, 2,  IF(Vout=12,4,1)))","v":1}]
["Efficiency",0.9,null,"Estimate of efficiency"]
["Pin",{"$f":"Pout/Efficiency","v":274.44444444444446},"W","Calculate input power assuming finite efficiency",null,null,null,null,null,null,null,null,null,null,null,null,null,null,null,null,null,null,null,null,null,"Internal Compensation",1]
[null,null,null,null,null,null,null,null,null,null,null,null,null,null,null,null,null,null,null,null,null,null,null,null,null,"External Compensation",2]
["Iin_Vinmin",{"$f":"Pin/VIN_min","v":11.435185185185185},"A",null,null,null,null,null,null,null,null,{"$f":"Vout","v":19},null,null,null,null,null,null,null,null,null,null,null,null,null,"COMP_TYPE",2]
["Iin_Vinnom",{"$f":"Pin/VIN_nom","v":11.435185185185185},"A","Input currents at min, nom, max Vin",null,null,null,{"$f":"AND(OSC=1, OR(Fsw/1000>2530, Fsw/1000<1800))","v":false}]
["Iin_Vinmax",{"$f":"Pin/VIN_max","v":11.435185185185185},"A",null,null,null,null,{"$f":"AND(OSC=2, OR(Fsw/1000>500, Fsw/1000<300))","v":false}]
[null,null,null,null,null,null,null,{"$f":"OR(H22,H23)","v":false}]
["OSC setting",{"$f":"CHOOSE(OSC, 2200, 440)","v":{"$error":"#VALUE!"}},"kHz",null,null,null,null,null,null,null,"SetVout_IntComp_nAEF",1,null,null,null,"LM5148",1,null,null,null,null,null,"No Input Filter",1,null,"UVLO Divider",1]
["Fsw",{"$f":"'Design Regulator'!E11*1000","v":425000},"Hz","Nominal switching frequency - determines RT resistor (SYNCIN must be 80-120% of this)",null,null,null,null,null,null,"SetVout_IntComp_AEF",2,null,null,null,"LM5148-Q1",2,null,null,null,null,null,"AEF Input Filter",2,null,"No UVLO Divider",2]
["RT resistor to AGND",{"$f":"((1000000000/Fsw)-53)/45+0.1","v":51.209803921568628},"kΩ",null,null,null,null,null,null,null,"SetVout_ExtComp_nAEF",3,null,null,null,"LM25148",3,null,null,null,null,null,"Passive LC Filter",3,null,"UVLO_TYPE",1]
[null,null,"kΩ",null,null,null,null,null,1,null,"SetVout_ExtComp_AEF",4,null,null,null,"LM25148-Q1",4,null,null,null,null,null,"INFILTER_TYPE",1]
["Tsw",{"$f":"1/Fsw","v":2.352941176470588E-6},"sec","Switching period",null,null,null,null,null,null,"AdjVout_IntComp_nAEF",5,null,null,"VARIANT",{"$f":"CHOOSE(VARIANT, \"LM5148\", \"LM5148-Q1\", \"LM25148\", \"LM25148-Q1\")","v":"LM5148"},1]
["Vref",0.8,"V","Reference voltage",null,null,null,null,null,null,"AdjVout_IntComp_AEF",6,null,null,"VIN-MAX",{"$f":"CHOOSE(VARIANT, 80, 80, 42, 42)","v":80},"V"]
["Rt",{"$f":"'Standard Value Calculator'!S12/1000","v":51.1},"kΩ","Frequency set resistor",null,{"$f":"IF(OR((Fsw=440000),(Fsw=2200000)),\"N/A\",Rfadj/1000)","v":5.11E-2},null,null,null,null,"AdjVout_ExtComp_nAEF",7,null,null,"VOUT-MAX",{"$f":"CHOOSE(VARIANT, 60, 60, 36, 36)","v":60},"V"]
[null,null,null,null,null,null,null,null,null,null,"AdjVout_ExtComp_AEF",8]
["Step 2: Buck Inductor","Channel 1",null,null,null,null,null,null,null,null,"Schematic setting",{"$f":"(IF(OR(Vout=3.3,Vout=5,Vout=12),CHOOSE(COMP_TYPE,IF(INFILTER_TYPE=1,1,2),IF(INFILTER_TYPE=1,3,4)),CHOOSE(COMP_TYPE,IF(INFILTER_TYPE=1,5,6),IF(INFILTER_TYPE=1,7,8))))","v":7}]
["Don1",{"$f":"Vout/VIN_nom","v":0.79166666666666663},null,null,null,"Ideal Duty Cycle at VIN(nom)"]
["Doff1",{"$f":"1-34:34","v":0.20833333333333337},null,null,null,"Ideal 1- Duty Cycle at VIN(nom)"]
[]
["D_Vinmin",{"$f":"Vout/VIN_min","v":0.79166666666666663}]
["D_Vinnom",{"$f":"Vout/VIN_nom","v":0.79166666666666663}]
["D_Vinmax",{"$f":"Vout/VIN_max","v":0.79166666666666663}]
[]
["L_Vinnom",{"$f":"(VIN_nom-Vout)*D1_Vinnom/(Fsw*(Iout/Number_of_Phases)*0.3)","v":2.3881347410759172E-6},"H",null,null,"Calculated inductance for 35% ripple at VIN(nom)"]
["L_slopecomp",{"$f":"1000*Vout*Rs/22.72/Fsw","v":5.9030654515327257E-6},"H",null,null,"Calculated inductance based on one times inductor downslope"]
[]
["Lopt",{"$f":"B42","v":5.9030654515327257E-6},"H",null,null,"Slope comp"]
[]
["Lo",{"$f":"'Design Regulator'!E27/1000000","v":4.6999999999999999E-6},"H",null,null,"Chosen inductance"]
["Rdcr",{"$f":"'Design Regulator'!E28/1000","v":5.1999999999999998E-3},"W",null,null,"Chosen inductor DCR"]
[]
["Don2",{"$f":"(Vout+Iout*(Rdcr+Rs))/(Vin+Iout*Rs)","v":0.79481675610466318}]
["Doff2",{"$f":"1-_Don2","v":0.20518324389533682}]
[]
["D_Vinmin_2",{"$f":"CHOOSE(MODE, (Vout+Iout*(Rdcr+Rs))/(VIN_min+Iout*Rs), (Vout+Iout/Number_of_Phases*(Rdcr+Rs))/(VIN_min+Iout/Number_of_Phases*Rs))","v":0.79481675610466318},null,null,null,"Duty cycles adjusted for DCR/shunt voltage drops"]
["D_Vinnom_2",{"$f":"CHOOSE(MODE, (Vout+Iout*(Rdcr+Rs))/(VIN_nom+Iout*Rs), (Vout+Iout/Number_of_Phases*(Rdcr+Rs))/(VIN_nom+Iout/Number_of_Phases*Rs))","v":0.79481675610466318},null,null,null,"need to include RDS(on) later"]
["D_Vinmax_2",{"$f":"CHOOSE(MODE, (Vout+Iout*(Rdcr+Rs))/(VIN_max+Iout*Rs), (Vout+Iout/Number_of_Phases*(Rdcr+Rs))/(VIN_max+Iout/Number_of_Phases*Rs))","v":0.79481675610466318}]
[]
["Iripple_Vinmin",{"$f":"(VIN_min-Vout)*D1_Vinmin_2/(Fsw*Lf)","v":1.9895288012632371},"A"]
["Iripple_Vinnom",{"$f":"(VIN_nom-Vout)*D1_Vinnom_2/(Fsw*Lf)","v":1.9895288012632371},"A"]
["Iripple_Vinmax",{"$f":"(VIN_max-Vout)*D1_Vinmax_2/(Fsw*Lf)","v":1.9895288012632371},"A"]
[]
["Ishunt_rms_Vinmin",{"$f":"SQRT((Iout/Number_of_Phases)^2+(Iripple_Vinmin^2)/12)","v":13.012680433750816},"A"]
["Ishunt_rms_Vinnom",{"$f":"SQRT((Iout/Number_of_Phases)^2+(Iripple_Vinnom^2)/12)","v":13.012680433750816},"A"]
["Ishunt_rms_Vinmax",{"$f":"SQRT((Iout/Number_of_Phases)^2+(Iripple_Vinmax^2)/12)","v":13.012680433750816},"A"]
["Max shunt power loss at full load",{"$f":"B61^2*Rs","v":0.50798955621276398},"W",null,null,"Note this is power loss at full load - not loss near OCP!"]
[]
["Max inductor ripple current",{"$f":"MAX(B56:B58)","v":1.9895288012632371},"A",null,null,"Ripple current at Vin(max)"]
[]
[null,{"$f":"B56/(Iout/Number_of_Phases)","v":0.15304067702024901}]
["% ripple current",{"$f":"B57/(Iout/Number_of_Phases)","v":0.15304067702024901}]
[null,{"$f":"B58/(Iout/Number_of_Phases)","v":0.15304067702024901}]
[]
["Inductor copper temerature",100,"°C"]
["DCR at hot",{"$f":"Rdcr*(1+0.0039*(B71-25))","v":6.7209999999999995E-3},"W"]
["Core loss",{"$f":"'Design Regulator'!E30","v":0.2},"W"]
[]
["Step 3: Sense Resistors, Slope Comp, Current Limit"]
[]
["Ilimit_DC",{"$f":"'Design Regulator'!E16","v":18.2},"A",null,null,"Chosen OCP level - based on output current"]
[]
["Ilimit_inductor_Vinmin",{"$f":"CHOOSE(MODE, Ilimit_DC+Iripple_Vinmin/2, Ilimit_DC/Number_of_Phases+Iripple_Vinmin/2)","v":19.19476440063162},"A",null,null,"Peak inductor current at current limit inception"]
["Ilimit_inductor_Vinnom",{"$f":"CHOOSE(MODE, Ilimit_DC+Iripple_Vinnom/2, Ilimit_DC/Number_of_Phases+Iripple_Vinnom/2)","v":19.19476440063162},"A"]
["Ilimit_inductor_Vinmax",{"$f":"CHOOSE(MODE, Ilimit_DC+Iripple_Vinmax/2, Ilimit_DC/Number_of_Phases+Iripple_Vinmax/2)","v":19.19476440063162},"A"]
[]
[]
["CS threshold_min",5.1999999999999998E-2,"V"]
["CS threshold",0.06,"V"]
["CS threshold_max",6.8000000000000005E-2,"V"]
[]
["Shunt required to get OCP at VIN(min)",{"$f":"Buck_CS_threshold/B79","v":3.12585238076825E-3},"W"]
["Shunt required to get OCP at VIN(nom)",{"$f":"Buck_CS_threshold/B80","v":3.12585238076825E-3},"W"]
["Shunt required to get OCP at VIN(max)",{"$f":"Buck_CS_threshold/B81","v":3.12585238076825E-3},"W"]
[]
["Rs_ideal",{"$f":"B89","v":3.12585238076825E-3},"W",null,null,"Ideal Rs for the required OCP -- based on 73mV CL threshold"]
["Rs",{"$f":"'Design Regulator'!E18/1000","v":3.0000000000000001E-3},"W",null,null,"Selected (starndard value) current limit sense resistor"]
[]
["Current limit - peak",{"$f":"Buck_CS_threshold/Rs","v":20},"A",null,null,"Peak inductor current limit = min sat current"]
[]
["Iout_OCP_Vinmin",{"$f":"Number_of_Phases*(Buck_CS_threshold/Rs-Iripple_Vinmin/2)","v":19.005235599368383},"A",null,null,"Current limit setpoints (i.e. IOUT) after standard components are selected"]
["Iout_OCP_Vinnom",{"$f":"Number_of_Phases*(Buck_CS_threshold/Rs-Iripple_Vinnom/2)","v":19.005235599368383},"A"]
["Iout_OCP_Vinmax",{"$f":"Number_of_Phases*(Buck_CS_threshold/Rs-Iripple_Vinmax/2)","v":19.005235599368383},"A"]
[]
["Irms_OCP_Vinmin",{"$f":"SQRT((Iout_OCP_Vinmin/Number_of_Phases)^2+(Iripple_Vinmin^2)/12)","v":19.013911545455887},"A"]
["Irms_OCP_Vinnom",{"$f":"SQRT((Iout_OCP_Vinnom/Number_of_Phases)^2+(Iripple_Vinnom^2)/12)","v":19.013911545455887},"A"]
["Irms_OCP_Vinmax",{"$f":"SQRT((Iout_OCP_Vinmax/Number_of_Phases)^2+(Iripple_Vinmax^2)/12)","v":19.013911545455887},"A"]
[]
["Pshunt_Vinmin",{"$f":"B101^2*Rs","v":1.0845864967752621},"W",null,null,"Max power dissipations in shunt"]
["Pshunt_Vinnom",{"$f":"B102^2*Rs","v":1.0845864967752621},"W"]
["Pshunt_Vinmax",{"$f":"B103^2*Rs","v":1.0845864967752621},"W"]
[]
[]
["Step 4: Output Capacitor"]
["Icoutrms_VINmin",{"$f":"Iripple_Vinmin/SQRT(12)","v":0.57432749448492171},"A",null,null,"Output Cap RMS current"]
["Icoutrms_VINnom",{"$f":"Iripple_Vinnom/SQRT(12)","v":0.57432749448492171},"A"]
["Icoutrms_VINmax",{"$f":"Iripple_Vinmax/SQRT(12)","v":0.57432749448492171},"A"]
["Max Cout rms current",{"$f":"MAX(B111:B113)","v":0.57432749448492171},"A"]
[]
["Vripple1",{"$f":"'Design Regulator'!E33/1000","v":0.14000000000000001},"V",null,null,"Output voltage ripple spec(pk-pk)"]
[]
["Output Ripple Spec (pk-pk)",{"$f":"Vo1_ripple*1000","v":140},"mV",null,null,"Vout ripple spec at Vin(nom)"]
[]
["Coutmin",{"$f":"Iripple_Vinnom/(Fsw*8*Vo1_ripple)","v":4.1796823555950352E-6},"F",null,null,"Minimum output capacitnace",null,{"$f":"Vo2_ripple","v":0},1]
["Reported Coutmin",{"$f":"IF(Cout_min*1000000<2, 2.2,Cout_min*1000000)","v":4.1796823555950349},"uF"]
["Cout",{"$f":"'Design Regulator'!E35/1000000","v":6.0000000000000002E-5},"F",null,null,"Chosen output capacitance",null,null,1]
["Resrmax",{"$f":"SQRT((Vo1_ripple/Iripple_Vinnom)^2-(1/(Fsw*Cout*8))^2)","v":7.0197474561212378E-2},"W",null,null,"Max ESR before ripple exceeds Vripple1",null,null,1]
[]
["Reported Cout ESR max",{"$f":"IF(OR(CoutEsrMax>0.3, CoutEsrMax<0, (ISERROR(CoutEsrMax))), \"N/A\", CoutEsrMax*1000)","v":70.197474561212374},"mΩ"]
["CoutEsr",{"$f":"'Design Regulator'!E37/1000","v":6.6299999999999998E-2},"W",null,null,"Chosen ESR",null,null,1,null,{"$f":"ISERROR(CoutEsrMax)","v":false},{"$f":"ISERROR(B125)","v":false}]
["Vripple",{"$f":"Iripple_Vinnom*SQRT(Cout_ESR^2+(1/(8*Fsw*Cout))^2)","v":0.13226580226739237},"Vp-p",null,null,null,null,null,null,null,null,{"$f":"OR(CoutEsrMax>0.3,CoutEsrMax<0)","v":false}]
[null,null,null,null,null,null,null,null,null,null,{"$f":"OR(TRUE, FALSE, TRUE)","v":true}]
["Step 5: Input Capacitor"]
[null,null,null,null,null,null,null,null,null,null,"Two channels operating at full load"]
["Icinrms_VINmin",{"$f":"SQRT(D1_Vinmin_2*(Iout^2*(1-D1_Vinmin_2)+Iripple_Vinmin^2/12))","v":5.2747713246235781},"A",{"$f":"D1_Vinmax","v":0.79166666666666663},null,"Calculate input cap rms current with one output unloaded",null,null,null,null,{"$f":"SQRT(Iout^2*D1_Vinmin*(1-D1_Vinmin)+Iout2^2*D2_Vinmin*(1-D2_Vinmin)-2*Iout*Iout2*D1_Vinmin*D2_Vinmin)","v":{"$error":"#NAME?"}},"A",{"$f":"SQRT(Iout^2*D1_Vinmin*(1-D1_Vinmin)+Iout2^2*D2_Vinmin*(1-D2_Vinmin)-2*Iout*Iout2*(0.5-D2_Vinmin*(1-D1_Vinmin)))","v":{"$error":"#NAME?"}},"A"]
["Icinrms_VINnom",{"$f":"SQRT(D1_Vinnom_2*(Iout^2*(1-D1_Vinnom_2)+Iripple_Vinnom^2/12))","v":5.2747713246235781},"A",{"$f":"D1_Vinmin","v":0.79166666666666663},null,null,null,null,null,null,{"$f":"SQRT(Iout^2*D1_Vinnom*(1-D1_Vinnom)+Iout2^2*D2_Vinnom*(1-D2_Vinnom)-2*Iout*Iout2*D1_Vinnom*D2_Vinnom)","v":{"$error":"#NAME?"}},"A"]
["Icinrms_VINmax",{"$f":"SQRT(D1_Vinmax_2*(Iout^2*(1-D1_Vinmax_2)+Iripple_Vinmax^2/12))","v":5.2747713246235781},"A",null,null,null,null,null,null,null,{"$f":"SQRT(Iout^2*D1_Vinmax*(1-D1_Vinmax)+Iout2^2*D2_Vinmax*(1-D2_Vinmax)-2*Iout*Iout2*D1_Vinmax*D2_Vinmax)","v":{"$error":"#NAME?"}},"A"]
["Icinrms - multiphase",{"$f":"Iout*SQRT((D1_Vinmin-F136/Number_of_Phases)*((F136+1)/Number_of_Phases-D1_Vinmin))","v":5.2795136034381898},"A",null,null,null,null,null,null,null,{"$f":"MAX(K131:K133)","v":{"$error":"#NAME?"}},"A"]
["Max Cin rms current",{"$f":"MAX(B131:B133)","v":5.2747713246235781},"A",null,null,{"$f":"Number_of_Phases*D1_Vinnom","v":0.79166666666666663},"N*D"]
[null,null,null,null,null,{"$f":"FLOOR(Number_of_Phases*D1_Vinnom,1)","v":0},"floor(N*D)"]
["Icinrms - multiphase - max",{"$f":"Iout/2/Number_of_Phases","v":6.5},"A"]
["Final result",{"$f":"IF(D1_Vinmin<0.5, B135, B137)","v":6.5},"A","…report this"]
[]
["Vinripple1",{"$f":"'Design Regulator'!E42/1000","v":0.9},"Vp-p",null,null,"Input voltage ripple spec (pk-pk)"]
[]
["Cinmin_Vinmin",{"$f":"Iout/Number_of_Phases*D1_Vinmin*(1-D1_Vinmin)/(Vinripple1*Fsw)","v":5.6054829339143066E-6},"F"]
["Cinmin_Vinnom",{"$f":"Iout/Number_of_Phases*D1_Vinnom*(1-D1_Vinnom)/(Vinripple1*Fsw)","v":5.6054829339143066E-6},"F"]
["Cinmin_Vinmax",{"$f":"Iout/Number_of_Phases*D1_Vinmax*(1-D1_Vinmax)/(Vinripple1*Fsw)","v":5.6054829339143066E-6},"F",null,null,"Calculate cap at Vinmax and 50% duty cycle (Vin = 2*Vout)"]
[]
["Cinmin_50%D",{"$f":"Iout*0.5*(1-0.5)/(Vinripple1*Fsw)","v":8.4967320261437909E-6},"F",null,null,"Buck 50% typically worst case"]
["Cinmin",{"$f":"IF(VIN_min>2*Vout, B142,B146)","v":8.4967320261437909E-6},"F",{"$f":"(VIN_min+VIN_max)/2","v":24}]
["Reported Cinmin",{"$f":"IF(Cinmin*1000000<2.2, 2.2,Cinmin*1000000)","v":8.4967320261437909},"uF",{"$f":"2*Vout","v":38},null,"…report this"]
[]
["Cin",{"$f":"'Design Regulator'!E44/1000000","v":1.2E-4},"F",null,null,"Input capacitance"]
["CinEsrMax_Vinmin",{"$f":"-(Iout/Number_of_Phases*D1_Vinmin*(1-D1_Vinmin)/(Cin*Fsw)-Vinripple1)/(Iout/Number_of_Phases+Iripple_Vinmin/2)","v":6.130570357846974E-2},"W"]
["CinEsrMax_Vinmax",{"$f":"-(Iout/Number_of_Phases*D1_Vinmax*(1-D1_Vinmax)/(Cin*Fsw)-Vinripple1)/(Iout/Number_of_Phases+Iripple_Vinmax/2)","v":6.130570357846974E-2},"W"]
["CinEsrMax_50%D",{"$f":"-(Iout/Number_of_Phases*0.5*(1-0.5)/(Cin*Fsw)-Vinripple1)/(Iout/Number_of_Phases+Iripple_Vinmax/2)","v":5.9756240681420721E-2},"W",null,null,"Calculate ESR at Vinmax and 50% duty cycle (Vin = 2*Vout)"]
["CinEsrMax",{"$f":"IF(VIN_min>2*Vout, B151,B153)","v":5.9756240681420721E-2},"W"]
["Reported Cin ESR max",{"$f":"IF(OR(CinEsrMax>0.3, CinEsrMax<0), \"N/A\",CinEsrMax*1000)","v":59.756240681420721},"mΩ",null,null,"…report this"]
["RCinEsr",{"$f":"'Design Regulator'!E46/1000","v":0.13300000000000001},"W",null,null,"Input capacitance series resistance (ESR)"]
[]
["Vinripple2_Vinmin",{"$f":"Iout/Number_of_Phases*D1_Vinmin_2*(1-D1_Vinmin_2)/(Cin*Fsw)+(Iout/Number_of_Phases +Iripple_Vinmin/2)*RCinEsr","v":1.9028738622282997},"Vp-p"]
["Vinripple2_Vinnom",{"$f":"Iout/Number_of_Phases*D1_Vinnom_2*(1-D1_Vinnom_2)/(Cin*Fsw)+(Iout/Number_of_Phases +Iripple_Vinnom/2)*RCinEsr","v":1.9028738622282997},"Vp-p"]
["Vinripple2_Vinmax",{"$f":"Iout/Number_of_Phases*D1_Vinmax_2*(1-D1_Vinmax_2)/(Cin*Fsw)+(Iout/Number_of_Phases +Iripple_Vinmax/2)*RCinEsr","v":1.9028738622282997},"Vp-p"]
["Vinripple2_50%D",{"$f":"Iout/Number_of_Phases*0.5*(1-0.5)/(Cin*Fsw)+(Iout/Number_of_Phases +Iripple_Vinmax/2)*RCinEsr","v":1.9250291554800838},"Vp-p",null,null,"Calculate ripple at Vinmax and 50% duty cycle (Vin = 2*Vout)"]
["Vinripple2",{"$f":"IF(D1_Vinmin<0.5, B158,B161)","v":1.9250291554800838},"Vp-p",null,null,"…report highest of these"]
[]
[null,{"$f":"Iout*D1_Vinmin_2*(1-D1_Vinmin_2)/(Cin*Fsw)","v":4.1570196944294244E-2},"Vp-p"]
[]
["Step 6a: Soft Start"]
["Tss",{"$f":"'Design Regulator'!E51/1000","v":0},"s","Soft-start time"]
["Iss",{"$f":"Cout*Vout/Tss","v":{"$error":"#DIV/0!"}},"A","Load cap current during soft start"]
["Css",{"$f":"0.000022*Tss/1.2","v":0},"F"]
["Css_u",{"$f":"'Standard Value Calculator'!B4","v":0},"F"]
[]
["Step 6b: Other Components - Dither, Hiccup, DEMB, MODE"]
["Tres",{"$f":"'Design Regulator'!E54/1000","v":1.0999999999999999E-2},"s","Hiccup time"]
["Cres",{"$f":"0.00002*Tres/1.2","v":1.8333333333333336E-7},"F"]
["Cres_u",{"$f":"'Standard Value Calculator'!G4","v":1.8E-7},"F"]
[]
["RPG1/2",100,"kΩ"]
["RFB1/2",null,"W",null,"Tie to VDDA or AGND for 3.3V/5V output, respectively. "]
["R_MODE",null,"W",null,"Tie to VDDA or AGND for Single/Dual operation, respectively. "]
["R_DEMB",null,"W",null,"Tie to VDDA or AGND for FPWM/DEM, respectively. "]
[]
["Enable Hysteresis Current",1.0000000000000001E-5,"A",null,"10 µA Hysteresis Current"]
["Turn ON Voltage",{"$f":"'Design Regulator'!E53","v":12}]
["Hysteresis Voltage",{"$f":"'Design Regulator'!E53-'Design Regulator'!E54","v":1}]
[]
["Upper FB resistor",{"$f":"B184/B182","v":99999.999999999985},"W"]
["Lower FB resister",{"$f":"B186/(B183-1)","v":9090.9090909090901},"W"]
["Standard upper FB resistor",{"$f":"'Standard Value Calculator'!S40","v":100},"kΩ"]
["Standard lower FB resistor",{"$f":"'Standard Value Calculator'!S41","v":9.09},"kΩ"]
[]
["Dither Modulation Frequency",{"$f":"'Design Regulator'!E57*1000","v":{"$error":"#VALUE!"}},"Hz"]
["Cdither_calculated",{"$f":"10*10^-6/Fdither/0.12","v":{"$error":"#VALUE!"}},"F"]
["Cdither_stdvalue",{"$f":"'Standard Value Calculator'!S21","v":{"$error":"#VALUE!"}},"F"]
[]
[]
["Step 7: Compensation"]
["Pi",3.1415926500000002,null,"p"]
["CS Amp Gain",10]
["Ri",{"$f":"Rs*CSAmp_gain","v":0.03},"W",null,null,"Current Sense effective resistance = shunt resistor Rs * CS amp gain"]
["gm",{"$f":"IF(COMP_TYPE=1,0.00003,0.0012)","v":1.1999999999999999E-3},"S",null,null,"Error Amp Transconductance"]
[]
["Se_ext",{"$f":"B206/Ri*1000","v":3219696.9696969702},"A/s",null,null,"Slope Comp Slope - referred to inductor current"]
["Sn",{"$f":"(Vin-Vout)/Lf","v":1063829.7872340425},"A/s",null,null,"On-time Slope"]
["Sf",{"$f":"Vout/Lf","v":4042553.1914893617},"A/s",null,null,"Off-time Slope"]
[]
["Se_int",{"$f":"Fsw*0.001*(5/22)","v":96.590909090909093},"mV/μs",null,null,"Slope Comp Slope - referred to IC"]
["Sn_int",{"$f":"Sn*Ri/1000","v":31.914893617021278},"mV/μs",null,null,"etc"]
["Sf_int",{"$f":"Sf*Ri/1000","v":121.27659574468085},"mV/μs",null,null,"etc"]
[]
["mc_buck",{"$f":"1+Se_ext/Sn","v":4.0265151515151523},null,null,null,"mc = 1 + Se/Sn for peak current-mode buck"]
["k_buck",{"$f":"mc_buck*(1-D1_Vinnom_2)","v":0.82617344038160256},null,null,null,"mc*(1-d)"]
[]
["mc",{"$f":"1+Se_ext/Sn","v":4.0265151515151523}]
["k",{"$f":"mc_buck*(1-D1_Vinnom_2)","v":0.82617344038160256}]
["Q",{"$f":"1/Pi/(k-0.5)","v":0.97589149556478305},null,null,null,"1/(Pi*(k-0.5))",null,"Q = 2/Pi = 0.636 gives ideal one-cycle damping"]
[]
["Error Amp (EA)"]
["GBW",6,"MHz",null,null,"EA gain-bandwidth product"]
["Cbw",{"$f":"gm/(2*Pi*GBW*1000000)","v":3.1830988654751269E-11},"F",null,null,"EA effective bandwidth limiting capacitance = gm/(2*Pi*GBW)"]
["RoEA",64000000,"W",null,null,"EA output resistance"]
["AEA",{"$f":"gm*RoEA","v":76800},"V/V",null,null,"EA DC gain = gm*RoEA"]
["Afb",{"$f":"IF(VOUT_setting=1,Vref/Vout,SQRT((1+(Fcross*zterm1)^2)/((1+Afbr-pterm4*(Fcross)^2)^2+(Fcross*pterm3)^2)))","v":4.2105263157894736E-2},"V/V",null,null,"Feedback gain from Vout to FB"]
["Acs",{"$f":"1/Ri","v":33.333333333333336},null,null,null,"Acs = 1/Ri"]
["Am_buck",{"$f":"(Ro/Number_of_Phases)/Ri/((1+Ro/Number_of_Phases*(k-0.5)/(Fsw*Lf)))","v":39.331303647012028}]
["Am",{"$f":"(Ro*Number_of_Phases)/Ri/((1+Ro*Number_of_Phases*(k-0.5)/(Fsw*Lf)))","v":39.331303647012028},null,null,null,"Buck modulator gain"]
[]
["Scaling factor to calculate Rcomp - buck",{"$f":"2*Pi*Ri/gm","v":157.07963250000003},null,null,null,"2*Pi*Ri/gm -- scaling factor to calculate Rcomp given desired buck crossover frequency"]
["DC Gain is Adc = AEA*Afb*Am"]
[]
["Ro",{"$f":"Rout","v":1.4615384615384615},"W",null,null,"Output Resistance"]
[]
["Fp_load_buck",{"$f":"1/(2*Pi*Ro*Cout)+(k-0.5)/(2*Pi*Fsw*Lf*Cout/Number_of_Phases)","v":2248.0671813831877},"Hz",null,null,"Buck dominant pole frequency -- note slope comp influence"]
["Fp_dominant",{"$f":"Fload_u","v":2248.0671813831877},"Hz"]
[null,{"$f":"Cbw","v":3.1830988654751269E-11}]
["Fp_EA",{"$f":"1/(2*Pi*(RoEA+Rcea1_u)*Cc1ea_u)","v":3.0312855381479173},"Hz",null,null,"Error Amp LF pole -- related to amplifier ouptut resistance and comp cap"]
["Fp_HF",{"$f":"1/(2*Pi*Rcea1_u*(Cc2ea_u+Cbw))","v":108635.88282769165},"Hz",null,null,"Error Amp HF pole cancels zero related to Output Cap ESR"]
["Fesr",{"$f":"1/(2*Pi*Cout*Cout_ESR)","v":40008.784131160479},"Hz",null,null,"Cout ESR zero frequency"]
["F_mod",{"$f":"Fsw/2","v":212500},"Hz",null,null,"Zero-order sample-and-hold effects of current-mode control modeled as pole at Fsw/2"]
[null,null,null,"Internal Comp Crossover"]
["Desired Crossover Frequency",{"$f":"CHOOSE(COMP_TYPE,Fcross_Ch2,'Design Regulator'!E63*1000)","v":65000},"Hz",{"$f":"Fsw/50","v":8500}]
["Rcea1",{"$f":"Fcross*Cout/Number_of_Phases*2*Pi*Ri/(gm*Afb)","v":14549.500960312502},"W",null,null,"This component will largely determine the crossover frequency",null,null,null,null,{"$f":"Fcross/Fp_dominant/(gm*Afb*Am)","v":14549.500960312509}]
["Cc1ea, Cc3ea",{"$f":"10/(Rcea1*Fcross*2*Pi)","v":1.6829014242523066E-9},"F",null,null,"This along with Rcea1 will set a zero at Fcrossover/5 to optimize phase margin"]
["Cc2ea, Cc4ea",{"$f":"MAX(1/(Rcea1*2*Pi*Fesr)-Cbw, 1/(Rcea1*2*Pi*(Fsw/2))-Cbw)","v":2.4158045073763862E-10},"F",null,null,"This along with Rcea1 places a pole at the output cap ESR zero"]
[]
[{"$f":"CHOOSE(COMP_TYPE,\"Internal Compensation\",\"External Compensation\")","v":"External Compensation"}]
["Chosen Compensation Components from the standard value sheet",null,null,"Internal Values"]
["Rcea1_u",{"$f":"CHOOSE(COMP_TYPE,D247,'Design Regulator'!D71*1000)","v":29400},"W",400000,null,null,{"$f":"1/(Rcea1*2*Pi*(Fsw/2))-Cbw","v":1.9645996087083998E-11}]
["Cc1ea_u",{"$f":"CHOOSE(COMP_TYPE,Cc3ea_u,'Design Regulator'!D72*0.000000001)","v":8.1999999999999996E-10},"F",{"$f":"50*0.000000000001","v":5.0000000000000002E-11}]
["Cc2ea_u",{"$f":"CHOOSE(COMP_TYPE,Cc4ea_u,'Design Regulator'!D73*0.000000000001)","v":1.7999999999999999E-11},"F",{"$f":"0.000000000001","v":9.9999999999999998E-13}]
[]
["Resulting Pole/Zero Locations",null,null,null,null,{"$f":"Cout","v":6.0000000000000002E-5},{"$f":"Cout_ESR","v":6.6299999999999998E-2}]
["Fz1",{"$f":"1/(2*Pi*Rcea1_u*Cc1ea_u)","v":6601.7481032751111},"Hz",null,null,"This zero is set at or close to the dominant load pole"]
["Fp2",{"$f":"1/(2*Pi*Rcea1_u*(Cc1ea_u*(Cc2ea_u+Cbw)/(Cc1ea_u+Cc2ea_u+Cbw)))","v":115237.63093096676},"Hz",null,null,"This pole cancels the zero from the Output Cap ESR"]
[null,null,null,"Internal Values"]
["Rfb1",{"$f":"IF(VOUT_setting=1,'Design Regulator'!E65*1000,2500000)","v":287000},"W",null,null,"Upper Feedback Resistance - chosen by user"]
["Rfb2",{"$f":"IF(Vout=Vref,100000000,Vref*B255/((Vout-Vref)))","v":12615.384615384615},"W",null,null,"Lower Feedback Resistance"]
["Rfb2_u",{"$f":"IF(Vout=Vref,\"N/A\",CHOOSE(VOUT_setting,'Standard Value Calculator'!S11,471000,792000,177000))","v":12700},"W",null,null,"Std Value Lower Feedback Resistance"]
[]
["Rff",20000,"W"]
["Cff",3.67E-13,"F"]
["Cfb",2.1999999999999999E-12,"F"]
[]
["wff",{"$f":"1/(2*Pi*Rff*Cff)","v":21683234.778440922},"Hz"]
["wfbt",{"$f":"1/(2*Pi*Rfb1_*Cfb)","v":252066.74576141333},"Hz"]
["wfbb",{"$f":"1/(2*Pi*Rfb2_u*Cfb)","v":5696311.4987028055},"Hz"]
["w1",{"$f":"1/(2*Pi*Rff*Cfb)","v":3617157.8016762817},"Hz"]
["wfft",{"$f":"1/(2*Pi*Cff*Rfb1_)","v":1511026.8138286357},"Hz"]
["Cfb*(Rff+RFBT)/(Rff*RFBT))",{"$f":"2*Pi*Cfb*(Rff+Rfb1_)/(Rff*Rfb1_)","v":7.393141727560975E-16},"Hz"]
[]
[]
[]
[]
["Other Input Variables"]
["Rfets",0,"W","Series resistance due to FETs"]
["Diode loss eq res",{"$f":"0.00000002*Fsw*0.6*4/Iripple1","v":{"$error":"#NAME?"}}]
["Fet loss eq res",{"$f":"_Don2*RdsonTop+Doff2*RdsonBot","v":{"$error":"#NAME?"}}]
["cap loss eq res",{"$f":"B278*Vin^2*Fsw/2/(((Iripple1/SQRT(3))^2))","v":{"$error":"#NAME?"}}]
["Sw cap",5.0000000000000001E-9]
[]
["Step 8: AEF"]
[]
["VinRipple_dBuV",{"$f":"20*LOG10(Vinripple2*1000000)","v":125.68874622980708},"dBuV"]
["CISPR 25 limit",{"$f":"CHOOSE(OSC,35,50)","v":{"$error":"#VALUE!"}},"dBuV","Chooses CISPR conducted limit 35 at 2.1MHz and 50 at 440kHz"]
["Attenuation required",{"$f":"VinRipple_dBuV-B283+3","v":{"$error":"#VALUE!"}},"dBuV","Margin of attenuation req"]
["Filter Frequency Required",{"$f":"Fsw/(POWER(10,Attn_req/40))","v":{"$error":"#VALUE!"}},"Hz","assume 40db/decade drop and set frequency based on attenuation"]
[]
["Lfilter",{"$f":"'Design Regulator'!E49","v":0.68},"uH","user input"]
[]
["Gop_AEF",{"$f":"CHOOSE(OSC,20,100)","v":{"$error":"#VALUE!"}}]
["n",3,null,null,null,"n should be 2 or 3"]
[]
["Passive Cf",{"$f":"1000000/(LinfilterPssv*POWER(2*Pi*Fx_infilter,2))","v":{"$error":"#VALUE!"}},"uF",{"$f":"'Design Input Filter'!G9*0.000001","v":6.8E-8}]
["Cinj_AEF",{"$f":"1000000/(L_infilter*Gop_AEF*0.000001*POWER(2*Pi*Fx_infilter,2))","v":{"$error":"#VALUE!"}},"uF",{"$f":"'Design Regulator'!#REF!*0.000001","v":{"$error":"#REF!"}}]
[]
["Cdamp_AEF",{"$f":"CHOOSE(OSC,0,Cinj_AEF/nAEF)","v":{"$error":"#VALUE!"}},"uF",{"$f":"'Design Regulator'!#REF!*0.000001","v":{"$error":"#REF!"}}]
["Rdamp_AEF",{"$f":"CHOOSE(OSC,SQRT(L_infilter*Gop_AEF/(Cinj_AEF)),1.09*SQRT(L_infilter*Gop_AEF/Cinj_AEF))","v":{"$error":"#VALUE!"}},"Ω",{"$f":"'Design Regulator'!#REF!","v":{"$error":"#REF!"}}]
["Ccomp_AEF",{"$f":"CHOOSE(OSC,5,1)","v":{"$error":"#VALUE!"}},"nF",{"$f":"B297*0.000000001","v":{"$error":"#VALUE!"}},null,"AEF Comp network & sense is specifically defined at 2.2MHz at 440kHz"]
["Rcomp_AEF",{"$f":"CHOOSE(OSC,200,1000)","v":{"$error":"#VALUE!"}},"Ω"]
["Csen_AEF",{"$f":"Gop_AEF*B297","v":{"$error":"#VALUE!"}},"nF",{"$f":"B299*0.000000001","v":{"$error":"#VALUE!"}}]
[]
["Rd_AEF",{"$f":"SQRT(L_infilter*0.000001/Cin)","v":7.5277265270908097E-2},null,{"$f":"'Standard Value Calculator'!S14","v":7.4999999999999997E-2}]
[]
["Attenuation at Fsw",{"$f":"'Input Filter Calculations'!W97","v":0},"dBuV"]
["Conducted EMC at Fsw",{"$f":"VinRipple_dBuV+B303","v":125.68874622980708},"dBuV"]
[]
[]
["Step 8: Efficiency"]
["VAR",0]
["Design"]
["Ta",{"$f":"'Design Regulator'!E13","v":30},"°C","Ambient Temperature"]
["Components"]
["LTc",{"$f":"4000/1000000","v":4.0000000000000001E-3},"%/°C","Inductor DCR Temp Co"]
["θCA",20,"°C/W","Inductor Core to Ambient Thermal Resistance"]
["RCinEsr",{"$f":"RCinEsr","v":0.13300000000000001},"W","Input Capacitor ESR"]
[]
["Controller Characteristics"]
["VCC",5,"V","with 170mA current limit"]
["Top Driver"]
["RdsonDRT",1,"W","Drain-Source Resistance of Pullup High-side FET Driver"]
["RdsonDRT2",0.5,"W","Drain-Source Resistance of Pulldown High-side FET Driver"]
["Bottom Driver"]
["RdsonDRB",1,"W","Drain-Source Resistance of Pullup Low-side FET Driver"]
["RdsonDRB2",0.5,"W","Drain-Source Resistance of Pulldown Low-side FET Driver"]
["Deadtime"]
["Deadtime",1.4E-8,"s","Total Deadtime",null,null,"14ns for LM513-Q1"]
["IQ"]
["IQ ",2.2000000000000001E-6,"A","Quiescent Current of LM5143-Q1 Controller (One channel disabled)"]
[]
["High- & low-side MOSFETs - Ch1","Q1: high-side",null,"Q2: low-side"]
["Rdson",{"$f":"'Design Regulator'!E82/1000","v":1.2E-2},"W",{"$f":"'Design Regulator'!F82/1000","v":4.0999999999999995E-3},"W","Drain-Source Resistances of Channel 1 FETs"]
["RdsonTopTc",{"$f":"4000/1000000","v":4.0000000000000001E-3},"%/°C",4.0000000000000001E-3,"%/°C","Drain-Source Resistance Temp Co"]
["Qg",{"$f":"'Design Regulator'!E83/1000000000","v":8.0000000000000005E-9},"C",{"$f":"'Design Regulator'!F83/1000000000","v":2.4999999999999999E-8},"C","Gate Charge at VCC = 5V"]
["Qgd",{"$f":"'Design Regulator'!E84/1000000000","v":2.8999999999999999E-9},"C",{"$f":"'Design Regulator'!F84/1000000000","v":8.9999999999999995E-9},"C","Gate to Drain Charge"]
["Qgs",{"$f":"'Design Regulator'!E85/1000000000","v":3.1E-9},"C",{"$f":"'Design Regulator'!F85/1000000000","v":8.6999999999999985E-9},"C","Gate to Source Charge"]
["Qoss",{"$f":"'Design Regulator'!E86/1000000000","v":0},"C",{"$f":"'Design Regulator'!F86/1000000000","v":2.9999999999999997E-8},"C","Output Charge"]
["Coss",{"$f":"'Design Regulator'!E87/1000000000000","v":1.16E-10},"F",{"$f":"'Design Regulator'!F87/1000000000000","v":3.6599999999999998E-10},"F","Output Capacitance"]
["Rgate",{"$f":"'Design Regulator'!E88","v":1.2},"W",{"$f":"'Design Regulator'!F88","v":1.2},"W","Gate Resistance"]
["Gfs",{"$f":"'Design Regulator'!E89","v":55},"S",{"$f":"'Design Regulator'!F89","v":178},"S","Transconductance"]
["Vth",{"$f":"'Design Regulator'!E90","v":3.1},"V",{"$f":"'Design Regulator'!F90","v":3},"V","Threshold Voltage"]
["Vsp",{"$f":"Vth_Q1+(Iout/Number_of_Phases)/Gfs_Q1","v":3.3363636363636364},"V",{"$f":"Vth_Q2+(Iout/Number_of_Phases)/Gfs_Q2","v":3.0730337078651684},"V","Switch Point Voltage of FETs"]
[]
["Vsd - Buck",{"$f":"'Design Regulator'!E91","v":0.7},"V",{"$f":"'Design Regulator'!F91","v":0.7},"V","Diode Forward Voltage of MOSFET Body diode"]
["QrrTop",null,"C",{"$f":"'Design Regulator'!F92/1000000000","v":5.8999999999999999E-8},"C","Reverse Recovery Charge of Body Diode"]
["TrrTop",4.0000000000000001E-8,"s",4.0000000000000001E-8,"s","Reverse Recovery Time of Body Diode"]
["θJA-MOSFET",{"$f":"'Design Regulator'!E93","v":42},"°C/W",{"$f":"'Design Regulator'!F93","v":40.700000000000003},"°C/W","Junction-to-Ambient Resistance"]
[]
[]
[]
["Anti-parallel Schottky Diode (optional)"]
["VfdSky",{"$f":"'Design Regulator'!F96","v":0},"V",{"$f":"'Design Regulator'!#REF!","v":{"$error":"#REF!"}},"V","Diode Forward Voltage"]
["QrrSky",{"$f":"'Design Regulator'!F97/1000000000","v":0},"C",{"$f":"'Design Regulator'!#REF!/1000000000","v":{"$error":"#REF!"}},"C","Diode Reverse Recovery Charge"]
["Ireverse",0,"A",0,"A","Reverse Leakage Current"]
[]
["Controller"]
["θJACtrl",34.1,"°C/W",null,null,"Junction-to-ambient thermal resistance of controller"]
["Outputs"]
["Top FET"]
["Tr",{"$f":"(Qgd_Q1+Qgs_Q1/2)*(RdsonDRT+Rgate1)/(VCC-Vsp_Q1)","v":5.8846994535519131E-9},"s"]
["Tf",{"$f":"(Qgd_Q1+Qgs_Q1/2)*(RdsonDRT2+Rgate1)/(Vsp_Q1)","v":2.2674386920980927E-9},"s"]
[]
["IC Power Disipation","Value","Units"]
["Power Dis",{"$f":"CHOOSE(Ext_VCC, (Qg_Q1+Qg_Q2)*Fsw*VCC, (Qg_Q1+Qg_Q2)*Fsw*Vin)","v":7.0124999999999993E-2},"W"]
["Temp rise",{"$f":"B362*ThetaJaCtrl","v":2.3912624999999998},"°C"]
["Junction temperature",{"$f":"B363 + Ta","v":32.391262499999996},"°C"]
[]
["Current (switching)",{"$f":"(Qg_Q1+Qg_Q2)*Fsw+Iq","v":1.40272E-2},"A"]
["Qrr Current",{"$f":"Qrr_Q2*Fsw","v":2.5075E-2},"A"]
["Diode Current",{"$f":"C368/Vin","v":{"$error":"#NAME?"}},{"$f":"Deadtime*Fsw*(Ipp/2)*(Vsd_Q1+Vsd_Q2)","v":{"$error":"#NAME?"}}]
["Total Application Switching IQ",{"$f":"SUM(B366:B368)","v":{"$error":"#NAME?"}},"A"]
[]
["Low-side MOSFET/Diode"]
["Part Power"]
["Power Dis"]
[]
["SCHEMATIC LABELS"]
[{"$f":"\"RC1 = \"&'Design Regulator'!D71&\"kΩ\"","v":"RC1 = 29,4kΩ"},{"$f":"'Design Regulator'!D71&\"kΩ\"","v":"29,4kΩ"},null,{"$f":"'Design Regulator'!D74&\"kΩ\"","v":"kΩ"}]
[{"$f":"\"RC2 = \"&'Design Regulator'!D74&\"kΩ\"","v":"RC2 = kΩ"},{"$f":"'Design Regulator'!D74&\"kΩ\"","v":"kΩ"}]
[]
[{"$f":"\"Lo = \"&'Design Regulator'!E27&\"µH\"","v":"Lo = 4,7µH"},{"$f":"'Design Regulator'!E27&\"µH\"","v":"4,7µH"},null,{"$f":"IF(MODE = 1, 'Design Regulator'!I27&\"µH\", 'Design Regulator'!E27&\"µH\")","v":"µH"}]
[{"$f":"\"Rdcr = \"&Rdcr*1000&\"mΩ\"","v":"Rdcr = 5,2mΩ"},{"$f":"Rdcr*1000&\"mΩ\"","v":"5,2mΩ"},null,{"$f":"IF(MODE=1, Rdcr2*1000&\"mΩ\", Rdcr*1000&\"mΩ\")","v":"0mΩ"}]
[{"$f":"\"Rs = \"&'Design Regulator'!E18&\"mΩ\"","v":"Rs = 3mΩ"},{"$f":"'Design Regulator'!E18&\"mΩ\"","v":"3mΩ"},null,{"$f":"IF(MODE = 1, 'Design Regulator'!I18&\"mΩ\", 'Design Regulator'!E18&\"mΩ\")","v":"mΩ"}]
[]
["IC",{"$f":"IF(VIN_max>42,\"LM5148(-Q1)\",\"LM25148(-Q1)\")","v":"LM25148(-Q1)"}]
[]
[{"$f":"IF((INFILTER_TYPE=1),\"AEF IS DISABLED!\",\"AEF\")","v":"AEF IS DISABLED!"},{"$f":"IF((INFILTER_TYPE=1),\"\",\"0.1µF\")","v":""},{"$f":"IF((INFILTER_TYPE=1),\"\",\"0.47Ω\")","v":""},{"$f":"IF((INFILTER_TYPE=1),\"\",\"3Ω\")","v":""},{"$f":"IF((INFILTER_TYPE=1),\"\",\"50kΩ\")","v":""}]
[{"$f":"\"LAEF =\"&L_infilter&\" uF\"","v":"LAEF =0,68 uF"},{"$f":"IF((INFILTER_TYPE=1),\"\",L_infilter&\"µH\")","v":""}]
[null,{"$f":"IF((INFILTER_TYPE=1),\"\",CinjSel*1000000&\"µF\")","v":""}]
[null,{"$f":"IF((INFILTER_TYPE=1),\"\",IF(OSC=1,\"DNP\",CdampSel*1000000&\"µF\"))","v":""}]
[null,{"$f":"IF((INFILTER_TYPE=1),\"\",RdampSel&\"Ω\")","v":""}]
[{"$f":"\"Rcomp =\"&Rcomp_AEF&\"Ω\"","v":{"$error":"#VALUE!"}},{"$f":"IF((INFILTER_TYPE=1),\"\",Rcomp_AEF&\"Ω\")","v":""}]
[{"$f":"\"Ccomp =\"&Ccomp_AEF*1000000000000&\"pF\"","v":{"$error":"#VALUE!"}},{"$f":"IF((INFILTER_TYPE=1),\"\",Ccomp_AEF*1000000000000&\"pF\")","v":""}]
[{"$f":"\"Csen =\"&Csen_AEF*1000000&\"µF\"","v":{"$error":"#VALUE!"}},{"$f":"IF((INFILTER_TYPE=1),\"\",Csen_AEF*1000000&\"µF\")","v":""}]
[null,"CDAMP"]
[]
[{"$f":"\"VOUT = \"&'Design Regulator'!E9&\"V\"","v":"VOUT = 19V"},{"$f":"'Design Regulator'!E9&\"V\"","v":"19V"},null,{"$f":"IF(MODE=1, 'Design Regulator'!I10&\"V\", \"\")","v":"V"}]
[]
[{"$f":"\"COUT = \"&'Design Regulator'!$E$35&\"µF\"","v":"COUT = 60µF"},{"$f":"ROUND('Design Regulator'!$E$35/Number_of_Phases, 0)&\"µF\"","v":"60µF"},null,{"$f":"IF(MODE=1, 'Design Regulator'!$I$35&\"µF\", ROUND('Design Regulator'!$E$35/Number_of_Phases, 0)&\"µF\")","v":"µF"}]
["Capacitance per component (Cout)",{"$f":"\"22µF\"","v":"22µF"}]
["# of output caps",{"$f":"ROUNDUP(Cout*1000000/22,0)&\" x\"","v":"3 x"}]
[]
["CIN",{"$f":"Cin*1000000&\"µF\"","v":"120µF"}]
["Capacitance per component (Cin)",{"$f":"\"10µF\"","v":"10µF"}]
["# of input caps",{"$f":"ROUNDUP(Cin*1000000/10,0)&\" x\"","v":"12 x"}]
["Cd",{"$f":"CHOOSE(INFILTER_TYPE,\"\",4*Cin*1000000&\"µF\")","v":""},null,null,{"$f":"COMP_TYPE","v":2}]
["Rd",{"$f":"CHOOSE(INFILTER_TYPE,\"\",D301&\"Ω\")","v":""}]
[]
[{"$f":"\"RC1 = \"&Rcea1_u/1000&\"kΩ\"","v":"RC1 = 29,4kΩ"},{"$f":"IF(COMP_TYPE=1,\"\",ROUND(Rcea1_u/1000,2)&\"kΩ\")","v":"29,4kΩ"},{"$f":"IF(OR(Vout=3.3,Vout=5,Vout=12),\"\",IF(COMP_TYPE=1,\"100kΩ\",\"\"))","v":""},{"$f":"IF(OR(Vout=3.3,Vout=5,Vout=12), IF(COMP_TYPE=1,\"\",ROUND(Rcea1_u/1000,2)&\"kΩ\"), \"\")","v":""},{"$f":"IF(OR(Vout=3.3,Vout=5,Vout=12),IF(COMP_TYPE=1,\"100kΩ\",\"\"),\"\")","v":""}]
[{"$f":"\"CC1 = \"&Cc1ea_u*10^9&\"nF\"","v":"CC1 = 0,82nF"},{"$f":"IF(COMP_TYPE=1,\"\",Cc1ea_u*10^9&\"nF\")","v":"0,82nF"}]
[{"$f":"\"CC2 = \"&IF(Cc2ea_u>0, Cc2ea_u*10^12&\"pF\", \"OPEN\")","v":"CC2 = 18pF"},{"$f":"IF(COMP_TYPE=1,\"\",IF(Cc2ea_u>0, ROUND(Cc2ea_u*10^12,1)&\"pF\", \"N/A\"))","v":"18pF"}]
[]
[{"$f":"\"gm = \"&$B$200*1000&\"mS\"","v":"gm = 1,2mS"},{"$f":"$B$200*1000&\"mS\"","v":"1,2mS"}]
[{"$f":"\"RoEA = \"&RoEA/1000000&\"MΩ\"","v":"RoEA = 64MΩ"},{"$f":"RoEA/1000000&\"MΩ\"","v":"64MΩ"}]
[{"$f":"\"GBW = \"&GBW&\"MHz\"","v":"GBW = 6MHz"},{"$f":"GBW&\"MHz\"","v":"6MHz"}]
[]
[]
["Cd",{"$f":"IF(DITHER=1, ROUND(Cdither*1000000000,1)&\"nF\", \"\")","v":{"$error":"#VALUE!"}},{"$f":"IF(DITHER=1, \"Cd\", \"\")","v":"Cd"}]
[{"$f":"\"RFB1 = \"&'Design Regulator'!E65&\"kΩ\"","v":"RFB1 = 287kΩ"},{"$f":"IF(VOUT_setting=1, 'Design Regulator'!E65&\"kΩ\", \"\")","v":"287kΩ"},null,{"$f":"'Design Regulator'!I65&\"kΩ\"","v":"kΩ"}]
[{"$f":"\"RFB2 = \"&IF(Vout=Vref,\"OPEN\",'Design Regulator'!E66&\"kΩ\")","v":"RFB2 = 12,7kΩ"},{"$f":"IF(VOUT_setting=1, IF(Vout=Vref,\"OPEN\",Rfb2_u/1000&\"kΩ\"), \"\")","v":"12,7kΩ"},null,{"$f":"IF(Vout2=Vref,\"OPEN\",Rfb4_u/1000&\"kΩ\")","v":"0kΩ"}]
[{"$f":"\"RFBSET = \"&CHOOSE(VOUT_setting,\"\",\"24.9kΩ\",\"0Ω\",\"48.7kΩ\")","v":"RFBSET = "},null,null,{"$f":"CHOOSE(VOUT_setting,\"\",\"24.9kΩ\",\"0Ω\",\"48.7kΩ\")","v":""}]
[]
["RENT",{"$f":"IF((UVLO_TYPE=1),B188&\"kΩ\",\"0Ω\")","v":"100kΩ"}]
["RENB",{"$f":"IF((UVLO_TYPE=1),B189&\"kΩ\",\"N/A\")","v":"9,09kΩ"}]
[]
[{"$f":"\"Crossover frequency = \"&ROUND('Stability Calculations'!U4,0)&\"kHz\"","v":"Crossover frequency = 251kHz"},{"$f":"ROUND('Stability Calculations'!U4,0)&\"kHz\"","v":"251kHz"},null,{"$f":"'Stability Calculations'!U4","v":251.19}]
[{"$f":"CHOOSE(BODE_PLOT_TYPE, \"Phase margin = \"&ROUND('Stability Calculations'!U5,0)&\"°\", \"°\")","v":"Phase margin = -5°"},{"$f":"ROUND('Stability Calculations'!U5,0)&\"°\"","v":"-5°"}]
[{"$f":"IF(loopPM<45,CHOOSE(COMP_TYPE,\"Phase margin is LOW, increase Cout\",\"Phase margin is LOW, recompensate\"),\"\")","v":"Phase margin is LOW, recompensate"}]
[]
["Full-load/high line efficiency",{"$f":"IF(PLOT_TYPE=1, ROUND('Efficiency Calculations'!AZ109,1)&\"%\", ROUND(#REF!,1)&\"%\")","v":"96,2%"}]
["Half-load/mid-line efficiency",{"$f":"IF(PLOT_TYPE=1, ROUND('Efficiency Calculations'!AZ59,1)&\"%\", ROUND(#REF!,1)&\"%\")","v":"97,6%"}]
[null,{"$f":"IF(VOUT_setting=1, \"\", IF(OSC=1, \"Tie OSC to VDDA\", \"Tie OSC to AGND\"))","v":""}]
[]
[]
[{"$f":"\"Rs = \"&Rs&\"Ω\"","v":"Rs = 0,003Ω"},{"$f":"'Standard Value Calculator'!S6&\"Ω\"","v":"Ω"}]
["Rset",{"$f":"'Standard Value Calculator'!S16&\"mΩ\"","v":"3,16mΩ"}]
["Rs",{"$f":"'Standard Value Calculator'!S6&\"mΩ\"","v":"mΩ"}]
[{"$f":"\"Rshunt = \"&ROUND(Rshunt,1)&\"mΩ\"","v":{"$error":"#NAME?"}},{"$f":"IF(Rshunt=\"0\", \"N/A\",ROUND(Rshunt,1)&\"mΩ\")","v":{"$error":"#NAME?"}}]
[]
["Rpgood","20kΩ"]
["RDAMP"]
[]
["VCCX",{"$f":"IF((Ext_VCC=1),\"5V\",\"GND\")","v":"5V"}]
["RCNFG",{"$f":" 'Design Regulator'!E57&\"kΩ\"","v":"41.2kΩ"}]
["Rt",{"$f":" Rfadj&\"kΩ\"","v":"51,1kΩ"},{"$f":"Rfadj","v":51.1},{"$f":"Fsw","v":425000},null,{"$f":"OR((Fsw=440000),(Fsw=2200000))","v":false},null,{"$f":"OR(OR(AND(OSC=1, OR(Fsw/1000>2530, Fsw/1000<1800)), AND(OSC=2, OR(Fsw/1000>500, Fsw/1000<300))), OR((Fsw=440000),(Fsw=2200000)))","v":false}]
["Css",{"$f":"'Standard Value Calculator'!B4*1000000000&\"nF\"","v":"0nF"},{"$f":"IF(MODE=1,\"Css\",\"\")","v":"Css"}]
["Cres",{"$f":"IF(Cres_u = 0, \"N/A\", Cres_u*1000000000 &\"nF\")","v":"180nF"},{"$f":"IF(Cres_u = 0, \"N/A\", Cres_u*1000000 &\"µF\")","v":"0,18µF"},{"$f":"Cres_u","v":1.8E-7}]
[]
["Blank out",{"$f":"IF(B76=\"y\",\"\",\"|\")","v":"|"}]
["OUTPUT CURRENT",{"$f":"'Design Regulator'!$E$10&\"A\"","v":"13A"}]
["VIN",{"$f":"VIN_nom&\"V\"","v":"24V"}]
["VIN range",{"$f":"VIN_min&\"V\"&\"...\"&VIN_max&\"V\"","v":"24V...24V"}]
[null,{"$f":"IF(INFILTER_TYPE=1,B450,\"\")","v":"24V...24V"},{"$f":"IF(INFILTER_TYPE=1,\"\",B450)","v":""}]
[{"$f":"CHOOSE(Ext_VCC, \"\", \"Tie VCCX to PGND\")","v":""}]

{"sheet":"Schematic Management","index":6,"n_rows":17,"n_cols":14,"rows_kept":17,"cut":false,"hidden":true,"merged":[]}
[null,null,null,null,null,null,null,null,null,null,null,null,null,"3.3V or 5V fixed (FB1/2)"]
[{"$f":"IF(MODE=1, CHOOSE(SCH_SETTING, \"SCH_SetVout_IntComp_nAEF\",\"SCH_SetVout_IntComp_AEF\",\"SCH_SetVout_ExtComp_nAEF\",\"SCH_SetVout_ExtComp_AEF\",\"SCH_AdjVout_IntComp_nAEF\",\"SCH_AdjVout_IntComp_AEF\",\"SCH_AdjVout_ExtComp_nAEF\",\"SCH_AdjVout_ExtComp_AEF\"))","v":"SCH_AdjVout_ExtComp_nAEF"},null,null,null,null,null,null,null,null,null,null,null,null,"With/without VOUT connected to VCCX"]
[]
[]
[]
[]
[]
[]
[]
[]
[]
[]
[]
[]
[]
[]
[null," "]

{"sheet":"Stability Calculations","index":7,"n_rows":687,"n_cols":35,"rows_kept":687,"cut":false,"hidden":true,"merged":[[9,27,9,28],[9,30,9,31],[10,2,10,3],[10,4,10,5],[10,8,10,9],[10,10,10,11],[10,12,10,13],[10,18,10,19],[10,14,10,15],[10,16,10,17],[9,1,10,1],[1,0,1,3],[1,9,1,11],[9,0,11,0],[9,18,9,19],[1,19,1,21],[10,6,10,7],[1,4,1,6],[9,2,9,7],[9,8,9,13],[9,20,9,22],[9,14,9,17],[1,12,1,14],[1,15,1,18]]}
[]
["Divider Network & EA Poles/Zeros",null,null,null,"Modulator",null,null,null,null,"Power Stage Poles/Zeros",null,null,"Complex Pole Pair",null,null,"Feedback natural frequencies",null,null,null,"Total System"]
[null,"Afb1",{"$f":"Afb","v":4.2105263157894736E-2},"V/V","Acs",{"$f":"Acs","v":33.333333333333336},"A/V","gm",{"$f":"gm","v":1.1999999999999999E-3},"z_ESR",{"$f":"Fesr","v":40008.784131160479},"Hz","p3",{"$f":"Fsw/2","v":212500},"Hz","zterm1",{"$f":"((1/wffHz)+(1/wfftHz))","v":7.0792020456570011E-7},null,null,"Adc",{"$f":"IF(VOUT_setting=1,Am*Afb*AEA,Am*AEA)","v":127185.01558275889},"V/V"]
[null,"EA zero, z1",{"$f":"Fz1_u","v":6601.7481032751111},"Hz","Am",{"$f":"Am","v":39.331303647012028},"V/V",null,null,"p_dom",{"$f":"Fp_dominant","v":2248.0671813831877},"Hz","pterm1",{"$f":"Q*pole3","v":207376.9428075164},null,"pterm3",{"$f":"((1/wfbtHz)+(1/wffHz)+(1/wfftHz)+(Afbr/wffHz))","v":5.7173306856057003E-6},null,null,"Crossover",{"$f":"AI7","v":251.19},"kHz"]
[null,"EA pole, p1",{"$f":"Fp1_u","v":3.0312855381479173},"Hz","Q",{"$f":"Q","v":0.97589149556478305},null,null,null,null,null,null,"pterm2",{"$f":"pole3^2","v":45156250000},null,"pterm4",{"$f":"1/(wffHz*wfbtHz)","v":1.8296177848724339E-13},null,null,"Phase Margin",{"$f":"AI9","v":-4.8133775158251808},"°"]
[null,"Aea",{"$f":"AEA","v":76800},"V/V","mc",{"$f":"mc","v":4.0265151515151523},null,null,null,null,null,null,null,null,null,"Afbr",{"$f":"Rfb1_/Rfb2_u","v":22.598425196850393},null,null,"radconv",{"$f":"180/Pi","v":57.295779578552292},null,null,null,null,null,null,null,null,null,null,null,null,"XOVER SEARCH"]
[null,"EA pole, p2",{"$f":"Fp2_u","v":108635.88282769165},"Hz","k",{"$f":"k","v":0.82617344038160256},null,null,null,null,null,null,null,null,null,null,null,null,null,null,null,null,null,null,null,null,null,null,null,null,null,null,null,"xover",{"$f":"SUM(AH12:AH613)/1000","v":251.19}]
[]
[null,null,null,null,null,null,null,null,null,null,null,null,null,null,null,null,null,null,null,null,null,null,null,null,null,null,null,null,null,null,null,null,null,"phase margin",{"$f":"SUM(AI13:AI613)","v":-4.8133775158251808}]
["Freq (Hz)",null,"Power Stage",null,null,null,null,null,"Error Amplifier",null,null,null,null,null,"Feedback Gain",null,null,null,"Sampling Double Pole",null,"System Response",null,null,null,null,null,null,"ERROR AMP Response",null,null,"PLANT Response"]
[null,null,"p_dom",null,"z_ESR",null,"z_RHP",null,"p1",null,"z1",null,"p2",null,"z1",null,"p1p2",null,"p3"]
[null,null,"Gain(V/V)","Phase(rad)","Gain(V/V)","Phase(rad)","Gain(V/V)","Phase(rad)","Gain(V/V)","Phase(rad)","Gain(V/V)","Phase(rad)","Gain(V/V)","Phase(rad)","Gain(V/V)","Phase(rad)","Gain(V/V)","Phase(rad)","Gain(V/V)","Phase(rad)","Gain (dB)","Phase (°)","Phase Margin (°)",null,null,"Fsquare",null,"Gain(dB)","Phase(Deg)",null,"Gain(dB)","Phase(Deg)"]
[1,{"$f":"A13/1000","v":1E-3},{"$f":"SQRT(1+(A13/pole1)^2)","v":1.000000098935331},{"$f":"ATAN(A13/pole1)","v":4.4482653468916285E-4},{"$f":"SQRT(1+(A13/Zero1)^2)","v":1.0000000003123628},{"$f":"ATAN(A13/Zero1)","v":2.4994511118195099E-5},{"$f":"IF(VIN_nom>Vout, 1, SQRT(1+(A13/z_RHP)^2))","v":1},{"$f":"IF(VIN_nom>Vout, 0, -ATAN(A13/z_RHP))","v":0},{"$f":"SQRT(1+(A13/Pole2)^2)","v":1.0530096949032202},{"$f":"ATAN(A13/Pole2)","v":0.31865110102017774},{"$f":"SQRT(1+(A13/Zero2)^2)","v":1.0000000114723424},{"$f":"ATAN(A13/Zero2)","v":1.5147503005388438E-4},{"$f":"SQRT(1+(A13/pole4)^2)","v":1.0000000000423666},{"$f":"ATAN(A13/pole4)","v":9.2050616605000082E-6},{"$f":"IF(VOUT_setting=1,1,SQRT(1+(A13*zterm1)^2))","v":1},{"$f":"IF(VOUT_setting=1,0,ATAN(((A13*zterm1))))","v":0},{"$f":"IF(VOUT_setting=1,1,SQRT((1+Afbr-pterm4*(A13)^2)^2+(A13*$Q$4)^2))","v":1},{"$f":"IF(VOUT_setting=1,0,ATAN(A13*$Q$4/(1+Afbr-$Q$5*(A13)^2)))","v":0},{"$f":"SQRT((1-(Z13/pterm2))^2+(A13/pterm1)^2)","v":0.99999999998948119},{"$f":"IF((ATAN((A13/pterm1)/(1-A13^2/pterm2))>0),ATAN((A13/pterm1)/(1-A13^2/pterm2)),PI()+ATAN((A13/pterm1)/(1-A13^2/pterm2)))","v":4.8221368609073225E-6},{"$f":"20*LOG10(((E13*K13*G13*O13)/(C13*I13*S13*M13*Q13))*Adc)","v":101.6400707995839},{"$f":"((F13+L13+H13+P13)-(D13+J13+T13+N13+R13))*radconv","v":-18.27354266893861},{"$f":"IF(V13>0,V13,V13+180)","v":161.7264573310614},null,{"$f":"IF(U13<0,A13,1000000000)","v":1000000000},{"$f":"A13^2","v":1},null,{"$f":"20*LOG10((K13/(I13*M13))*AEA)","v":97.25857710614136},{"$f":"(L13-(J13+N13))*radconv","v":-18.249211777765392},null,{"$f":"20*LOG10((E13*G13/(C13*S13))*Acs*Am)","v":62.352340878267007},{"$f":"(F13+H13-(D13+T13))*radconv","v":-2.4330891173219897E-2},null,{"$f":"SUM((U14<0)*(U13>0))*A13","v":0},{"$f":"IF(AH13>0,W11,0)","v":0}]
[1.0965,{"$f":"A14/1000","v":1.0965E-3},1.0000001189511594,4.8775228877815687E-4,1.0000000003755576,2.7406481439946294E-5,1,0,1.0634128746131302,0.34708423298930158,1.000000013793338,1.6609237019708448E-4,1.0000000000509379,1.0093350110680584E-5,1,0,{"$f":"IF(VOUT_setting=1,1,SQRT((1+Afbr-pterm4*(A14)^2)^2+(A14*$Q$4)^2))","v":1},0,0.99999999998735312,5.287473068000276E-6,101.55467976091786,-19.904202444875164,160.09579755512485,null,1000000000,1.2023122500000001,null,97.173186240763187,-19.87752362307657,null,62.352340704979142,-2.6678821798592489E-2,null,0,0]
[1.2022999999999999,1.2022999999999999E-3,1.0000001430135201,5.3481492694099932E-4,1.0000000004515284,3.005090071461793E-5,1,0,1.0757860732409579,0.37759817986927779,1.0000000165835612,1.8211842801322045E-4,1.0000000000612421,1.1067245634279893E-5,1,0,{"$f":"IF(VOUT_setting=1,1,SQRT((1+Afbr-$Q$5*(A15)^2)^2+(A15*$Q$4)^2))","v":1},0,0.99999999998479483,5.7976551479060538E-6,101.45419950089108,-21.654234601767723,158.34576539823229,null,1000000000,1.4455252899999997,null,97.0727061890573,-21.624981572210444,null,62.352340496658258,-2.9253029557276222E-2,null,0,0]
[1.3183,1.3183000000000001E-3,1.0000001719411789,5.8641479213958618E-4,1.00000000054286,3.2950264002053306E-5,1,0,1.090475247425567,0.41022437756639951,1.0000000199379548,1.9968953099303973E-4,1.0000000000736295,1.2135032786784243E-5,1,0,1,0,0.99999999998171929,6.3570230238016452E-6,101.33640139405648,-23.525454845803711,156.47454515419628,null,1000000000,1.7379148900000001,null,96.95490833266507,-23.493379433605046,null,62.352340246215846,-3.2075412198663056E-2,null,0,0]
[1.4454,1.4454000000000001E-3,1.0000002066938187,6.4295222705067982E-4,1.0000000006525824,3.6127066362045099E-5,1,0,1.1078647791226535,0.44493827401242142,1.0000000239678015,2.1894200661603058E-4,1.0000000000885114,1.3304996123677408E-5,1,0,1,0,0.99999999997802425,6.969916618864718E-6,101.19898225574306,-25.516471008506649,154.48352899149336,null,1000000000,2.0891811599999999,null,96.817489495224081,-25.481303141050837,null,62.352339945343445,-3.516786745581095E-2,null,0,0]
[1.5849,1.5849E-3,1.0000002485164321,7.0500550452519319E-4,1.0000000007846266,3.9613800658755301E-5,1,0,1.1284367442143279,0.48175808191252634,1.0000000288174686,2.4007277235633969E-4,1.0000000001064211,1.4589102225103466E-5,1,0,1,0,0.99999999997357758,7.6426047110183393E-6,101.03917266380016,-27.628347634176905,152.37165236582308,null,1000000000,2.51190801,null,96.65768026536216,-27.589785608783849,null,62.35233958326247,-3.8562025393057274E-2,null,0,0]
[1.7378,1.7378000000000001E-3,1.0000002987796086,7.730194489938265E-4,1.0000000009433196,4.3435461402928838E-5,1,0,1.152674834165611,0.52054680800555375,1.0000000346458868,2.6323330316094126E-4,1.0000000001279448,1.5996556152704277E-5,1,0,1,0,0.99999999996823363,8.3799094371283952E-6,100.8545804336095,-29.853251766425931,150.14674823357407,null,1000000000,3.0199488400000001,null,96.473088470326971,-29.810969549644888,null,62.352339148106992,-4.2282216781047238E-2,null,0,0]
[1.9055,1.9055000000000001E-3,1.0000003592272397,8.4761681476501277E-4,1.0000000011341674,4.762704090962734E-5,1,0,1.1811655363703735,0.56119191029478632,1.0000000416552748,2.8863566395976296E-4,1.0000000001538301,1.7540244992779364E-5,1,0,1,0,0.99999999996180688,9.188581788806876E-6,100.64250086531504,-32.184757874851599,147.81524212514842,null,1000000000,3.63093025,null,96.261009425360285,-32.138395370146881,null,62.352338624779208,-4.6362504704725034E-2,null,0,0]
[2.0893000000000002,2.0893000000000001E-3,1.0000004318699118,9.293758726451743E-4,1.000000001363518,5.2221032042650075E-5,1,0,1.2145202333823937,0.60347167242791988,1.0000000500787758,3.164767721462212E-4,1.0000000001849374,1.9232135325454704E-5,1,0,1,0,0.99999999995408351,1.0074890543981691E-5,100.4006205578533,-34.61018358124953,145.38981641875046,null,1000000000,4.3651744900000002,null,96.019129746805334,-34.559349062138224,null,62.352337995872425,-5.0834519111308409E-2,null,0,0]
[2.2909000000000002,2.2909000000000002E-3,1.0000005192345525,1.0190528227813562E-3,1.0000000016393495,5.7259925470017707E-5,1,0,1.2534596250531218,0.64717221373693978,1.0000000602094079,3.4701413507547683E-4,1.0000000002223493,2.1087875755509171E-5,1,0,1,0,0.99999999994479483,1.1047033335328114E-5,100.12650798548623,-37.117301930754124,142.88269806924586,null,1000000000,5.2482228100000006,null,95.745017930801012,-37.061562308522575,null,62.352337239509687,-5.5739622231545508E-2,null,0,0]
[2.5118999999999998,2.5118999999999996E-3,1.0000006242463182,1.1173593811783038E-3,1.0000000019708972,6.2783712408374953E-5,1,0,1.2987203784609411,0.69197290447462301,1.0000000723863673,3.8049011254089624E-4,1.0000000002673179,2.312219438154239E-5,1,0,1,0,0.99999999993362998,1.211272558183886E-5,99.818401068968555,-39.687768078763099,140.3122319212369,null,1000000000,6.309641609999999,null,95.436911923426649,-39.626651335641313,null,62.352336330366363,-6.1116743121778748E-2,null,0,0]
[2.7542,2.7542000000000001E-3,1.0000007504853485,1.2251407096806419E-3,1.0000000023694646,6.883988242732584E-5,1,0,1.351124846043241,0.73754151049468519,1.0000000870248,4.1719250676112914E-4,1.0000000003213767,2.5352580820633374E-5,1,0,1,0,0.99999999992020827,1.3281129343569935E-5,99.474803599075571,-42.302577151293463,137.69742284870654,null,1000000000,7.5856176399999997,null,95.093315546452715,-42.235565041309229,null,62.352335237447321,-6.7012109984227089E-2,null,0,0]
[3.02,3.0200000000000001E-3,1.0000009023294316,1.3433754152547544E-3,1.0000000028488736,7.5483423449306187E-5,1,0,1.4115834441915927,0.78353318363529589,1.0000001046323475,4.5745456235175169E-4,1.0000000003864,2.7799286208334101E-5,1,0,1,0,0.99999999990406407,1.4562853321642329E-5,99.094580922546754,-44.942006398178428,135.05799360182158,null,1000000000,9.1204000000000001,null,94.713094184519434,-44.868527148052571,null,62.352333922851784,-7.3479250125848203E-2,null,0,0]
[3.3113000000000001,3.3113000000000001E-3,1.0000010847964516,1.4729531362315078E-3,1.0000000034249668,8.2764324493937711E-5,1,0,1.4809735823505585,0.8295178287425079,1.0000001257908746,5.0157922879089383E-4,1.0000000004645371,3.0480720667834968E-5,1,0,1,0,0.99999999988466404,1.5967541789812722E-5,98.677764414857421,-47.581445540313503,132.4185544596865,null,1000000000,10.964707690000001,null,94.296279256544523,-47.500878715828819,null,62.352332343137356,-8.0566824484685773E-2,null,0,0]
[3.6307999999999998,3.6308E-3,1.0000013042348586,1.615074884383562E-3,1.0000000041177877,9.0750070737714362E-5,1,0,1.5603417904922805,0.87514543286360846,1.0000001512365377,5.4997548787505651E-4,1.0000000005585061,3.3421737865443236E-5,1,0,1,0,0.99999999986133337,1.7508214517652576E-5,98.224314161523139,-50.200883996057613,129.7991160039424,null,1000000000,13.182708639999998,null,93.84283090300535,-50.112543470729022,null,62.352330443342254,-8.8340525328587716E-2,null,0,0]
[3.9811000000000001,3.9811000000000004E-3,1.000001568040465,1.770897182828475E-3,1.000000004950687,9.9505647904953528E-5,1,0,1.6507133451886524,0.92002696772757275,1.0000001818269439,6.0303717366074849E-4,1.0000000006714744,3.6646270961246944E-5,1,0,1,0,0.99999999983328547,1.9197409061061465E-5,97.735273701672924,-52.778074152418966,127.22192584758103,null,1000000000,15.849157210000001,null,93.353792727060124,-52.681210540926486,null,62.352328159437256,-9.6863611492478144E-2,null,0,0]
[4.3651999999999997,4.3651999999999996E-3,1.000001885208186,1.9417544768898973E-3,1.000000005952064,1.0910603952292826E-4,1,0,1.753208886558917,0.96382463594748258,1.0000002186051309,6.6121870988450078E-4,1.000000000807294,4.0181935139923796E-5,1,0,1,0,0.99999999979956411,2.1049591830703197E-5,97.212031254861643,-55.293710181155532,124.70628981884447,null,1000000000,19.054971039999998,null,92.830553026137181,-55.18750110746943,null,62.35232541354894,-0.10620907368610663,null,0,0]
[4.7862999999999998,4.7862999999999994E-3,1.0000022664741675,2.1290701664216714E-3,1.0000000071558153,1.1963122801922342E-4,1,0,1.8689935692190718,1.0062325690561045,1.0000002628160483,7.2500481486331085E-4,1.0000000009705619,4.4058186598388119E-5,1,0,1,0,0.99999999975902765,2.3080193664639297E-5,96.656545461434462,-57.730318881661248,122.26968111833875,null,1000000000,22.908667689999998,null,92.2750705335296,-57.613864113481135,null,62.352322112729325,-0.11645476818010625,null,0,0]
[5.2481,5.2481000000000003E-3,1.0000027249280841,2.334490049800215E-3,1.000000008603269,1.3117369307436716E-4,1,0,1.9993599144466541,1.0470127053934302,1.0000003159775595,7.9495594384697223E-4,1.0000000011668837,4.830908406425383E-5,1,0,1,0,0.99999999971028464,2.5307056469396586E-5,96.070878481760474,-60.074320186110569,119.92567981388943,null,1000000000,27.542553609999999,null,91.689407522929997,-59.946629470264554,null,62.352318143654941,-0.12769071584603559,null,0,0]
[5.7544000000000004,5.7544000000000007E-3,1.0000032760522248,2.5597043895629144E-3,1.0000000103433064,1.4382841381671874E-4,1,0,2.1456191399102678,1.0859573057238432,1.0000003798849757,8.7164769885806086E-4,1.0000000014028896,5.2969606771137004E-5,1,0,1,0,0.99999999965168884,2.7748504365231748E-5,95.457641182917968,-62.313872990547047,117.68612700945295,null,1000000000,33.113119360000006,null,91.076174995453854,-62.173863620961832,null,62.352313372288563,-0.14000936958521878,null,0,0]
[6.3095999999999997,6.3095999999999994E-3,1.0000039387120665,2.8066703186179205E-3,1.0000000124354913,1.5770536607677548E-4,1,0,2.3092452487837782,1.1229315132481863,1.0000004567259229,9.5574656592827521E-4,1.0000000016866581,5.8080256989423604E-5,1,0,1,0,0.99999999958123442,3.0425754754578461E-5,94.819287628620629,-64.441321753276227,115.55867824672377,null,1000000000,39.811052159999996,null,90.437827178141561,-64.287803973906207,null,62.352307635303525,-0.15351777937003711,null,0,0]
[6.9183000000000003,6.9183000000000005E-3,1.0000047353183992,3.0774339028339023E-3,1.0000000149505812,1.7291952458151996E-4,1,0,2.4917641937057593,1.1578365135434687,1.000000549099145,1.0479493248180352E-3,1.0000000020277862,6.3683378001545057E-5,1,0,1,0,0.99999999949653862,3.33609894673191E-5,94.158543890507872,-66.451079242748705,113.5489207572513,null,1000000000,47.862874890000008,null,89.777090336652051,-66.28275138325057,null,62.352300738680285,-0.16832785949812629,null,0,0]
[7.5857999999999999,7.5858000000000002E-3,1.0000056931545496,3.3743525422697497E-3,1.0000000179747173,1.8960336020784317E-4,1,0,2.6949061878204859,1.1906348409489182,1.0000006601684102,1.1490587860561606E-3,1.0000000024379578,6.9827756632701799E-5,1,0,1,0,0.99999999939470074,3.6579765829243693E-5,93.477802343136887,-68.341084575726086,111.65891542427391,null,1000000000,57.544361639999998,null,89.096357081744912,-68.156516022377701,null,62.352292446216438,-0.18456855334838113,null,0,0]
[8.3176000000000005,8.3176000000000014E-3,1.0000068445674692,3.6998725462827594E-3,1.0000000216100293,2.0789434272492331E-4,1,0,2.9204602187592044,1.2213136671375189,1.000000793684676,1.2599080529657996E-3,1.0000000029310245,7.6564020719930025E-5,1,0,1,0,0.99999999927228156,4.0108605593646969E-5,92.779640665171272,-70.110691717016962,109.88930828298304,null,1000000000,69.182469760000004,null,88.398205372122902,-69.908318049747507,null,62.352282477872826,-0.20237366726945547,null,0,0]
[9.1201000000000008,9.1201000000000008E-3,1.0000082290338139,4.0568404906843767E-3,1.0000000259811572,2.2795243694820829E-4,1,0,3.1704920775587424,1.2499092804571066,1.0000009542256778,1.3814665533396654E-3,1.0000000035238921,8.3951082655074242E-5,1,0,1,0,0.99999999912508375,4.3978370437181626E-5,92.066122519237069,-71.762083366825792,108.23791663317421,null,1000000000,83.176224010000013,null,87.68469921217428,-71.54018446584918,null,62.352270491887261,-0.2218989009766123,null,0,0]
[10,0.01,1.0000098934846626,4.4482363012566251E-3,1.0000000312362789,2.4994510602909664E-4,1,0,3.4471643065013984,1.2764717766656628,1.0000011472335959,1.5147491536099654E-3,1.0000000042366579,9.2050616347608681E-5,1,0,1,0,0.99999999894811731,4.8221368677790524E-5,91.339403541268354,-73.298238180120208,106.70176181987979,null,1000000000,100,null,86.957994644128433,-73.054930932281124,null,62.352256081964399,-0.24330724783907212,null,0,0]
[10.965,1.0964999999999999E-2,1.0000118950459009,4.8774845959861377E-3,1.0000000375557605,2.7406480760627284E-4,1,0,3.7529580585580851,1.3010816064257644,1.0000013793328459,1.6609221899343486E-3,1.0000000050937858,1.0093350076747763E-4,1,0,1,0,0.99999999873530865,5.2874730770595209E-5,90.601153686794191,-74.723890191821866,105.27610980817813,null,1000000000,120.23122499999999,null,86.219762118066129,-74.457104167399791,null,62.352238753552527,-0.26678602442206589,null,0,0]
[12.023,1.2022999999999999E-2,1.0000143012507681,5.3480987896714514E-3,1.0000000451528306,3.0050899819075022E-4,1,0,4.0904238824258758,1.3238197088103725,1.0000016583547526,1.821182286822596E-3,1.0000000061241963,1.1067245589546426E-4,1,0,1,0,0.99999999847947696,5.7976551598488119E-5,89.853243180775479,-76.043804647319376,103.95619535268062,null,1000000000,144.55252899999999,null,85.471872443594179,-75.751277243502628,null,62.352217922005792,-0.29252740381674047,null,0,0]
[13.183,1.3183E-2,1.0000171939715474,5.8640813757278353E-3,1.0000000542859935,3.2950262821486388E-4,1,0,4.4624686581291702,1.3447858963305814,1.0000019937935047,1.9968926822121393E-3,1.0000000073629509,1.2135032727813472E-4,1,0,1,0,0.99999999817191743,6.3570230395454196E-5,89.097083770440108,-77.263845945030468,102.73615405496953,null,1000000000,173.79148899999998,null,84.715738076715482,-76.943095635144331,null,62.352192878549076,-0.32075030988613895,null,0,0]
[14.454000000000001,1.4454E-2,1.0000206691704026,6.4294345624771286E-3,1.0000000652582441,3.6127064806036488E-4,1,0,4.872005427136612,1.3640728077652415,1.0000023967773173,2.1894166027816081E-3,1.000000008851146,1.3304996045952861E-4,1,0,1,0,0.99999999780242654,6.9699166396152985E-5,88.334405481395706,-78.389467443104621,101.61053255689538,null,1000000000,208.91811600000003,null,83.953089873780272,-78.037793792943035,null,62.352162792439913,-0.35167365016159075,null,0,0]
[15.849,1.5848999999999999E-2,1.0000248513375107,7.0499394131025035E-3,1.0000000784626573,3.9613798607340735E-4,1,0,5.323246055679113,1.38181821004701,1.00000288174276,2.4007231575080522E-3,1.0000000106420952,1.4589102122632781E-4,1,0,1,0,0.99999999735776746,7.6426047383755438E-5,87.564997920381444,-79.428772845303612,100.57122715469639,null,1000000000,251.19080099999999,null,83.183718519226858,-79.043159215416125,null,62.35212658597905,-0.38561362988747544,null,0,0]
[17.378,1.7378000000000001E-2,1.0000298775189957,7.7300420601889176E-3,1.0000000943319609,4.3435458698676531E-4,1,0,5.8194439022875644,1.3981014867457515,1.0000034645827529,2.6323270124666114E-3,1.0000000127944904,1.599655601762354E-4,1,0,1,0,0.99999999682336804,8.3799094731916974E-5,86.790860548905272,-80.386472172021129,99.613527827978871,null,1000000000,301.99488400000001,null,82.409624660933019,-79.963658736221888,null,62.352083072796717,-0.4228134357992378,null,0,0]
[19.055,1.9054999999999999E-2,1.0000359220852415,8.4759671948627571E-3,1.0000001134167451,4.762703734450301E-4,1,0,6.3651553343898231,1.4130374029946213,1.0000041655188809,2.8863487043267115E-3,1.0000000153830095,1.7540244814697009E-4,1,0,1,0,0.99999999618068747,9.1885818363505751E-5,86.012263875135986,-81.269367334456959,98.730632665543041,null,1000000000,363.09302500000001,null,81.631080316521221,-80.805753799086418,null,62.352030743439222,-0.46361353537054573,null,0,{"$f":"IF(AH45>0,W43,0)","v":0}]
[20.893000000000001,2.0893000000000002E-2,1.0000431860679828,9.2934938363289608E-3,1.0000001363518003,5.2221027343165574E-4,1,0,6.9646205732632973,1.4267155017075397,1.0000050078651603,3.1647572613373504E-3,1.0000000184937512,1.9232135090709653E-4,1,0,1,0,0.9999999954083485,1.0074890606652963E-4,85.230439182483323,-82.082798891158959,97.917201108841041,null,1000000000,436.51744900000006,null,80.849318509605652,-81.574468874403465,null,62.351967857702128,-0.50833001675551093,null,0,0]
[22.909000000000002,2.2909000000000002E-2,1.0000519221207749,1.0190179025469483E-2,1.0000001639349401,5.7259919274662804E-4,1,0,7.6233918411577983,1.4392419899065867,1.0000060209228547,3.4701275611341066E-3,1.000000022234925,2.1087875446043535E-4,1,0,1,0,0.99999999447948529,1.1047033417947983E-4,84.44535668790715,-82.833126830757863,97.166873169242137,null,1000000000,524.82228100000009,null,80.064311644159588,-82.275750612665931,null,62.351892228572019,-0.55737621809193505,null,0,0]
[25.119,2.5118999999999999E-2,1.0000624227029962,1.1173133491337941E-2,1.0000001970897083,6.2783704241520548E-4,1,0,8.3467036692920296,1.4507000657056721,1.000007238610787,3.8048829476508739E-3,1.0000000267317932,2.3122193973597904E-4,1,0,1,0,0.99999999336299739,1.2112725690750212E-4,83.65794127896217,-83.525376567406255,96.474623432593745,null,1000000000,630.96416099999999,null,79.276987139222413,-82.914235505865562,null,62.351801324564235,-0.61114106154069414,null,0,0]
[27.542000000000002,2.7542000000000001E-2,1.0000750457470908,1.2250800314365715E-2,1.0000002369464434,6.8839871661826538E-4,1,0,9.1407786845288594,1.461177050719713,1.0000087024425284,4.1719011058392041E-3,1.0000000321376672,2.5352580282883336E-4,1,0,1,0,0.99999999202082035,1.3281129487136242E-4,82.86848069272699,-84.164858195628213,95.835141804371787,null,1000000000,758.56176400000004,null,78.487635829970344,-83.494771855608477,null,62.351692047581118,-0.67008634001973044,null,0,0]
[30.2,3.0199999999999998E-2,1.0000902289132467,1.3432954208851907E-2,1.0000002848873213,7.5483409256490628E-4,1,0,10.012830868020286,1.4707576946272871,1.0000104631805515,4.574514033314765E-3,1.000000038640015,2.7799285499385329E-4,1,0,1,0,0.99999999040640941,1.4562853510914576E-4,82.076890764715941,-84.756782830538256,95.243217169461744,null,1000000000,912.04,null,77.696177339935957,-84.022036154437117,null,62.351560609604448,-0.73474667610115085,null,0,0]
[33.113,3.3112999999999997E-2,1.0001084738206962,1.4728476915751743E-2,1.0000003424966133,8.2764305785251681E-4,1,0,10.969424559293191,1.4795070982593168,1.0000125790091317,5.0157506464383822E-3,1.0000000464537155,3.0480719733312801E-4,1,0,1,0,0.99999998846641414,1.5967542039307635E-4,81.284211827050939,-85.305203249673582,94.694796750326418,null,1000000000,1096.470769,null,76.903656342542163,-84.499595409302358,null,62.351402669333226,-0.80560784037122501,null,0,0]
[36.308,3.6308E-2,1.0001304150668671,1.6149358813044957E-2,1.0000004117786845,9.0750046074218008E-4,1,0,12.019428036128243,1.4875014084149452,1.0000151235405521,5.4996999833306246E-3,1.0000000558506266,3.3421736633470789E-4,1,0,1,0,0.99999998613333752,1.7508214846559557E-4,80.490044794897784,-85.814918090596237,94.185081909403763,null,1000000000,1318.2708640000001,null,76.109679244829806,-84.931592465888556,null,62.351212734892414,-0.88332562470768017,null,0,0]
[39.811,3.9810999999999999E-2,1.0001567918775942,1.7707139459783916E-2,1.000000495068579,9.9505615391965872E-4,1,0,13.171387732444563,1.4948010546052923,1.0000181825307468,6.0302993702386854E-3,1.0000000671474565,3.6646269337182449E-4,1,0,1,0,0.99999998332854656,1.9197409494647581E-4,79.694888282614372,-86.289808947465701,93.710191052534299,null,1000000000,1584.9157210000001,null,75.314751057909092,-85.32127780064566,null,62.350984409529737,-0.96853114682004726,null,0,0]
[43.652000000000001,4.3652000000000003E-2,1.0001885032295599,1.9415129311917211E-2,1.0000005952062205,1.091059966621546E-3,1,0,14.43517024461145,1.5014655493501072,1.0000218602765509,6.6120917011184563E-3,1.0000000807293923,4.0181932998974195E-4,1,0,1,0,0.99999997995640677,2.104959240228521E-4,78.898838099276944,-86.73376912970987,93.26623087029013,null,1000000000,1905.497104,null,74.518975369255017,-85.6718167634547,null,62.350709914846391,-1.0619523662551644,null,0,0]
[47.863,4.7863000000000003E-2,1.0002266219948328,2.1287517711902688E-2,1.0000007155812867,1.1963117151937903E-3,1,0,15.821305135108943,1.5075482557606275,1.0000262812629361,7.2499223942859049E-3,1.0000000970561858,4.4058183776149419E-4,1,0,1,0,0.99999997590277034,2.3080194418109107E-4,78.102138483480815,-87.15037137806479,92.84962862193521,null,1000000000,2290.8667689999997,null,73.722605699365161,-85.986006090489965,null,62.350379968940103,-1.164365287574822,null,0,0]
[52.481000000000002,5.2481E-2,1.0002724560635072,2.3340703401164502E-2,1.0000008603265276,1.3117361859195517E-3,1,0,17.341972400785707,1.5131007550969129,1.0000315972617515,7.9493936605194906E-3,1.0000001166883734,4.830908034376256E-4,1,0,1,0,0.99999997102846638,2.5307057462678245E-4,77.304664091998106,-87.543166427177141,92.456833572822859,null,1000000000,2754.255361,null,72.925528018647725,-86.266499701407682,null,62.349983258174845,-1.2766667257694633,null,0,0]
[57.544000000000004,5.7544000000000005E-2,1.0003275521139037,2.5591511492334084E-2,1.0000010343301104,1.4382831563119133E-3,1,0,19.009685672175852,1.5181672721801138,1.0000379877832519,8.7162584554745359E-3,1.0000001402889525,5.2969601866644054E-4,1,0,1,0,0.99999996516888545,2.7748505674613411E-4,76.506713638364999,-87.915298682817237,92.084701317182763,null,1000000000,3311.3119360000005,null,72.128054417431457,-86.515521913318395,null,62.349506405758007,-1.3997767694988381,null,0,0]
[63.095999999999997,6.3095999999999999E-2,1.0003937944452941,2.8059410553934551E-2,1.0000012435483718,1.5770523664148321E-3,1,0,20.838938598283871,1.5227908016103147,1.0000456715597816,9.557177575682585E-3,1.0000001686657987,5.8080250523963426E-4,1,0,1,0,0.99999995812344689,3.0425756480700894E-4,75.708193657554474,-88.269937737661706,91.730062262338294,null,1000000000,3981.1052159999995,null,71.330107724313336,-86.73517770586102,null,62.348933118065588,-1.5347600318006889,null,0,0]
[69.183000000000007,6.9183000000000008E-2,1.0004734208974004,3.0764726556055062E-2,1.0000014950570113,1.7291935395549849E-3,1,0,22.844887386533806,1.5270088652269811,1.0000549084221031,1.0479113490678317E-2,1.0000002027786117,6.3683369478552464E-4,1,0,1,0,0.9999999496538754,3.3360991742753337E-4,74.909315988286835,-88.609970202757779,91.390029797242221,null,1000000000,4786.2874890000012,null,70.531919123717671,-86.927242262804455,null,62.348244049393628,-1.6827279399533128,null,0,0]
[75.858000000000004,7.5858000000000009E-2,1.0005691551067963,3.3730855011195979E-2,1.0000017974701378,1.8960313527591889E-3,1,0,25.044998225500326,1.530857577704605,1.0000660146838309,1.149008724250525E-2,1.0000002437957509,6.9827745397054895E-4,1,0,1,0,0.99999993947008914,3.6579768828891621E-4,74.109944031499651,-88.938312886396403,91.061687113603597,null,1000000000,5754.4361640000006,null,69.733375555286244,-87.093353183421982,null,62.347415661037857,-1.8449597029744216,null,0,0]
[83.176000000000002,8.3176E-2,1.0006842250073975,3.6982025323151271E-2,1.0000021610006142,2.0789404621390571E-3,1,0,27.457399529735259,1.5343682156388254,1.0000793653496585,1.2598420612514566E-2,1.0000002931024217,7.6564005908807162E-4,1,0,1,0,0.99999992722816766,4.0108609547861372E-4,73.310296005029272,-89.257634686514848,90.742365313485152,null,1000000000,6918.2469760000004,null,68.934723123388252,-87.234854689188239,null,62.346420066465491,-2.0227799973266261,null,0,0]
[91.201000000000008,9.1201000000000004E-2,1.0008225684578023,4.054639328577625E-2,1.0000025981123903,2.2795204606653099E-3,1,0,30.103189222842737,1.5375711425204805,1.0000954180610029,1.3813795600669226E-2,1.0000003523891534,8.3951063130001467E-4,1,0,1,0,0.99999991250838394,4.3978375649907976E-4,72.51017599587685,-89.57069356012461,90.42930643987539,null,1000000000,8317.6224010000005,null,68.135799921002999,-87.352965496401964,null,62.345223259698301,-2.2177280637226477,null,0,0]
[100,0.1,1.0009888644338929,4.4453351809053056E-2,1.0000031236230531,2.4994459074559709E-3,1,0,33.004456905117024,1.5404927508144262,1.0001147168454267,1.5146344765074933E-2,1.0000004236657112,9.2050590608481076E-4,1,0,1,0,0.99999989481175133,4.8221375549521185E-4,71.709702938195491,-89.880063123478166,90.119936876521834,null,1000000000,10000,null,67.336765266536162,-87.448652565436333,null,62.343784856483794,-2.4314105580418301,null,0,0]
[109.65,0.10965000000000001,1.0011888050359932,4.8736608724359753E-2,1.0000037555690742,2.7406412829032389E-3,1,0,36.186591700927117,1.5431582632259764,1.0001379238682284,1.6607710113045415E-2,1.0000005093784525,1.0093346683467854E-3,1,0,1,0,0.9999998735308846,5.2874739829840997E-4,70.908672852897709,-90.188404429767758,89.811595570232242,null,1000000000,12023.122500000001,null,66.537464280529122,-87.522734623354168,null,62.342055757193052,-2.6656698064135993,null,0,0]
[120.23,0.12023,1.0014291141195162,5.3430594604069161E-2,1.0000045152729777,3.0050810265269739E-3,1,0,39.675644339972564,1.5455892778935574,1.0001658218643317,1.8209829955157537E-2,1.000000612419442,1.1067241116202752E-3,1,0,1,0,0.99999984794773855,5.797656354124749E-4,70.107310325745175,-90.498194037771071,89.501805962228929,null,1000000000,14455.252900000001,null,65.738179502058415,-87.5758068026431,null,62.339978008511217,-2.9223872351279656,null,0,0]
[131.83000000000001,0.13183,1.0017179362838464,5.8574405041952694E-2,1.0000054285847582,3.2950144765564035E-3,1,0,43.501294836803602,1.5478064802161944,1.0001993596771011,1.9966299732317352E-2,1.0000007362948327,1.2135026830741688E-3,1,0,1,0,0.99999981719180064,6.3570246139230298E-4,69.305540053753973,-90.812021639684303,89.187978360315697,null,1000000000,17379.148900000004,null,64.938905766234868,-87.608322794507174,null,62.337481472343583,-3.2036988451771253,null,0,0]
[144.54,0.14454,1.0020648066876494,6.4206854476590844E-2,1.0000065258033324,3.6126909206393555E-3,1,0,47.693224762065093,1.5498274514244921,1.0002396493030703,2.1890703644792002E-2,1.0000008851142177,1.3304988273506544E-3,1,0,1,0,0.99999978024273573,6.9699187146736235E-4,68.503801216829757,-91.132283609781325,88.867716390218675,null,1000000000,20891.811599999997,null,64.140164268474734,-87.620559078297148,null,62.334484133179487,-3.5117245314841794,null,0,0]
[158.49,0.15849000000000002,1.0024820842593909,7.0384105563637875E-2,1.0000078462352398,3.9613593467815499E-3,1,0,52.29430998617655,1.5516726218345096,1.000288133180842,2.4002667097913127E-2,1.0000010642089525,1.4589091875577434E-3,1,0,1,0,0.99999973577686774,7.6426074740962909E-4,67.70066134873322,-91.462162276167646,88.537837723832354,null,1000000000,25119.080100000003,null,63.340628750851437,-87.612630334600411,null,62.330879782706248,-3.8495319415672395,null,0,0]
[173.78,0.17377999999999999,1.0029833463551328,7.7148534987379058E-2,1.0000094331520561,4.3435188276506678E-3,1,0,57.337533372017248,1.5533548596828259,1.0003463988793777,2.631725348283729E-2,1.0000012794482254,1.5996542509570692E-3,1,0,1,0,0.99999968233698633,8.3799130795224851E-4,66.897146234650947,-91.80389705372933,88.19610294627067,null,1000000000,30199.488400000002,null,62.541441430700893,-87.584463530359415,null,62.326551988774526,-4.2194335233699096,null,0,0]
[190.55,0.19055000000000002,1.0035858439056931,8.455958089992871E-2,1.0000113416108301,4.7626680836922054E-3,1,0,62.869072230239901,1.5548895838366454,1.0004164660337043,2.8855555736140629E-2,1.0000015382997891,1.7540227006494098E-3,1,0,1,0,0.99999961806898741,9.1885865907214413E-4,66.092592479356526,-92.160480452411051,87.839519547588949,null,1000000000,36309.302500000005,null,61.742086635321051,-87.535807401448977,null,62.321353028859939,-4.624673050962083,null,0,0]
[208.93,0.20893,1.0043094145233289,9.2671412454752911E-2,1.0000136350880049,5.2220557402404798E-3,1,0,68.931806685682034,1.5562887267862238,1.0005006624385402,3.1637118769346377E-2,1.0000018493734362,1.9232111616256432E-3,1,0,1,0,0.99999954083521903,1.0074896873781874E-3,65.287429013168875,-92.534498323476427,87.465501676523573,null,1000000000,43651.744900000005,null,60.94316271973068,-87.466294349819833,null,62.315113478262646,-5.0682039736565807,null,0,0]
[229.09,0.22909000000000002,1.0051789361828263,0.10155474747434272,1.0000163933609889,5.7259299751358482E-3,1,0,75.581812073958162,1.5575652444739196,1.0006019129484478,3.468749594428757E-2,1.0000022234900481,2.1087844499562479E-3,1,0,1,0,0.99999944794905726,1.1047041679937398E-3,64.48085981578734,-92.929173945075917,87.070826054924083,null,1000000000,52482.2281,null,60.144085665968234,-87.375292253859158,null,62.307621334643564,-5.5538816912167484,null,0,0]
[251.19,0.25119000000000002,1.0062231016323504,0.11127443186352838,1.0000197087785527,6.2782887575391641E-3,1,0,82.871866241187689,1.5587292126465417,1.0007236018987167,3.8030667490369631E-2,1.0000026731757932,2.3122153179279937E-3,1,0,1,0,0.99999933630048543,1.2112736581889251E-3,63.673127475361369,-93.34732556841513,86.65267443158487,null,1000000000,63096.416100000002,null,59.345341653290021,-87.262088827887339,null,62.298633006895805,-6.0852367405277903,null,0,0]
[275.42,0.27542,1.0074769042536817,0.12190662673591146,1.0000236943664265,6.8838795142502802E-3,1,0,90.864643816798832,1.5597907238948581,1.0008698697028158,4.1695074275909794E-2,1.0000032137616086,2.535252650808676E-3,1,0,1,0,0.99999920208311388,1.3281143843773228E-3,62.863855528398574,-93.792146317137309,86.207853682862691,null,1000000000,75856.176400000011,null,58.546850223814985,-87.125732996783086,null,62.287852489408039,-6.6664133203542253,null,0,0]
[302,0.30199999999999999,1.0089829516771112,0.13353814900833588,1.0000284883303938,7.5481990023448919E-3,1,0,99.63271650997973,1.5607592945271545,1.0010457767045966,4.5713589731435404E-2,1.0000038639941053,2.7799214604836845E-3,1,0,1,0,0.99999904064250311,1.4562872438149176E-3,62.052303922050591,-94.267134038234246,85.732865961765754,null,1000000000,91204,null,57.74823016070313,-86.965002520653499,null,62.274920946171918,-7.3021315175807606,null,0,0]
[331.13,0.33112999999999998,1.0107897609276684,0.1462438380417454,1.0000342490807013,8.276243499352829E-3,1,0,109.24205928213942,1.5616422155212708,1.0012571186510988,5.0115927732044568E-2,1.0000046453608753,3.0480626281616683E-3,1,0,1,0,0.99999884664367555,1.5967566988814763E-3,61.238884189706241,-94.775166442587363,85.224833557412637,null,1000000000,109647.0769,null,56.950298822454272,-86.778718136843679,null,62.259432552076433,-7.996448305743689,null,0,0]
[363.08,0.36307999999999996,{"$f":"SQRT(1+(A77/pole1)^2)","v":1.0129583970639642},{"$f":"ATAN(A77/pole1)","v":0.16012491241272303},{"$f":"SQRT(1+(A77/Zero1)^2)","v":1.0000411770291466},{"$f":"ATAN(A77/Zero1)","v":9.0747579846432985E-3},{"$f":"IF(VIN_nom>Vout, 1, SQRT(1+(A77/z_RHP)^2))","v":1},{"$f":"IF(VIN_nom>Vout, 0, -ATAN(A77/z_RHP))","v":0},{"$f":"SQRT(1+(A77/Pole2)^2)","v":119.7817391406827},{"$f":"ATAN(A77/Pole2)","v":1.5624477118571736},{"$f":"SQRT(1+(A77/Zero2)^2)","v":1.0015112235929096},{"$f":"ATAN(A77/Zero2)","v":5.4942203814664567E-2},{"$f":"SQRT(1+(A77/pole4)^2)","v":1.0000055850472176},{"$f":"ATAN(A77/pole4)","v":3.3421613437051149E-3},{"$f":"IF(VOUT_setting=1,1,SQRT(1+(A77*zterm1)^2))","v":1},{"$f":"IF(VOUT_setting=1,0,ATAN(((A77*zterm1))))","v":0},1,{"$f":"IF(VOUT_setting=1,0,ATAN(A77*$Q$4/(1+Afbr-$Q$5*(A77)^2)))","v":0},{"$f":"SQRT((1-(Z77/pterm2))^2+(A77/pterm1)^2)","v":0.99999861333701479},{"$f":"IF((ATAN((A77/pterm1)/(1-A77^2/pterm2))>0),ATAN((A77/pterm1)/(1-A77^2/pterm2)),PI()+ATAN((A77/pterm1)/(1-A77^2/pterm2)))","v":1.7508247737282551E-3},{"$f":"20*LOG10(((E77*K77*G77*O77)/(C77*I77*S77*M77*Q77))*Adc)","v":60.422512081540788},{"$f":"((F77+L77+H77+P77)-(D77+J77+T77+N77+R77))*radconv","v":-95.320046265655719},{"$f":"IF(V77>0,V77,V77+180)","v":84.679953734344281},null,{"$f":"IF(U77<0,A77,1000000000)","v":1000000000},{"$f":"A77^2","v":131827.0864},null,{"$f":"20*LOG10((K77/(I77*M77))*AEA)","v":56.152480014128159},{"$f":"(L77-(J77+N77))*radconv","v":-86.565195041921967},null,{"$f":"20*LOG10((E77*G77/(C77*S77))*Acs*Am)","v":62.240879252237093},{"$f":"(F77+H77-(D77+T77))*radconv","v":-8.754851223733743},null,{"$f":"SUM((U78<0)*(U77>0))*A77","v":0},{"$f":"IF(AH77>0,W75,0)","v":0}]
[398.11,{"$f":"A78/1000","v":0.39811000000000002},1.0155593699474856,0.1752727463045925,1.0000495056447474,9.9502364286321431E-3,1,0,131.33752502555816,1.5631822830389495,1.0018166195515998,6.0230784806072579E-2,1.0000067147233391,3.6646106932042019E-3,1,0,1,0,0.99999833285937878,1.9197452853299171E-3,59.602986829998954,-95.905019874466149,84.094980125533851,null,1000000000,158491.57210000002,null,55.355154159217967,-86.322744486524869,null,62.218679855605444,-9.5822753879412872,null,0,0]
[436.52,0.43651999999999996,1.0186776719152735,0.19178904248257603,1.0000595188685264,1.0910171089086299E-2,1,0,144.0083816973567,1.563852230729073,1.0021836673471411,6.6025768732770496E-2,1.0000080729069807,4.0181718906088367E-3,1,0,{"$f":"IF(VOUT_setting=1,1,SQRT((1+Afbr-$Q$5*(A79)^2)^2+(A79*$Q$4)^2))","v":1},0,0.99999799564750036,2.1049649560549075E-3,58.779638471837316,-96.53356065833745,83.46643934166255,null,1000000000,190549.71039999998,null,54.558345295208412,-86.049359104416041,null,62.192140361453369,-10.484201553921395,null,0,0]
[478.63,0.47863,1.0224135830080896,0.20977509983948897,1.0000715555941682,1.1962552202000274E-2,1,0,157.89987212731512,1.5644631571007204,1.0026247162611128,7.2373864673938693E-2,1.0000097055719452,4.4057901555565604E-3,1,0,1,0,0.99999759028689628,2.3080269765190838E-3,57.951877433460872,-97.208916724242471,82.791083275757529,null,1000000000,229086.67689999999,null,53.762272662362676,-85.742852392025057,null,62.160451955922646,-11.466064332217417,null,0,0]
[524.80999999999995,0.52481,1.0268878399962136,0.22934203177688942,1.0000860289892672,1.3116617111953489E-2,1,0,173.13405405916336,1.5650204234601519,1.0031547997138948,7.9328784349740486E-2,1.0000116687699538,4.830870829984478E-3,1,0,1,0,0.99999710286090304,2.5307156791002992E-3,57.118638884338807,-97.9344522120644,82.0655477879356,null,1000000000,275425.53609999997,null,52.966832186781417,-85.400649186415436,null,62.122653882381854,-12.533803025648954,null,0,0]
[575.44000000000005,0.57544000000000006,1.0322408400269101,0.25059048268734513,1.0001034277158853,1.4381849829682453E-2,1,0,189.8362845598617,1.5655286055731714,1.0037916621279439,8.6945042175833515E-2,1.0000140287978301,5.2969111425605385E-3,1,0,1,0,0.99999651690915781,2.7748636613031414E-3,56.279192085835838,-98.712834329617976,81.287165670382024,null,1000000000,331131.19360000006,null,52.172389720593898,-85.020088590155595,null,62.077649550066397,-13.692745739462383,null,0,0]
[630.96,0.63096000000000008,1.0386406483790784,0.27362781751089127,1.0001243471833978,1.5769229504322857E-2,1,0,208.15171435831257,1.5659921201621205,1.0045568777055205,9.528526065749765E-2,1.0000168664390594,5.8079603991030918E-3,1,0,1,0,0.99999581237448443,3.0425929093343615E-3,55.432273305380832,-99.546604219211275,80.453395780788725,null,1000000000,398110.52160000004,null,51.378968687275673,-84.598067665669717,null,62.024151802929609,-14.948536553541558,null,0,0]
[691.83,0.69183000000000006,1.0462822717673661,0.2985464830137754,1.0001494946385643,1.7290229441353788E-2,1,0,228.23209233221596,1.5664148080110729,1.0054759996708658,0.10441385995753109,1.0000202776576315,6.368251720003053E-3,1,0,1,0,0.99999496543060451,3.3361219286809204E-3,54.576807554182061,-100.437300026608,79.562699973392,null,1000000000,478628.74890000006,null,50.586948211201126,-84.131358010160241,null,61.960706527805385,-16.305942016447759,null,0,0]
[758.58,0.75858000000000003,1.0553972783330605,0.32543887891592499,1.0001797310236979,1.8958064693346176E-2,1,0,250.2522599528952,1.5668003482510839,1.0065800378310974,0.11440418280186823,1.0000243792808863,6.9826621865230242E-3,1,0,1,0,0.99999394707116274,3.6580068794686582E-3,53.711207462776628,-101.38589316243832,78.614106837561678,null,1000000000,575443.61640000006,null,49.796418751613636,-83.616247629823334,null,61.885635895987463,-17.769645532614977,null,0,0]
[831.76,0.83175999999999994,1.0662512920815512,0.35437019342776249,1.0002160769502875,2.078644027981371E-2,1,0,274.39365680268668,1.5671519196126278,1.0079056006479723,0.12533050304784496,1.0000293098169259,7.6562524848607814E-3,1,0,1,0,0.99999272290673613,4.0109004970891211E-3,52.834128608662354,-102.39170189204594,77.608298107954056,null,1000000000,691824.69759999996,null,49.007885641684787,-83.048953029902151,null,61.797090151802024,-19.3427488621438,null,0,0]
[912.01,0.91200999999999999,1.0791577055496744,0.38539870611430271,1.0002597778342919,2.2791297007972756E-2,1,0,300.86741288917858,1.567472597476405,1.0094971632754564,0.13727784962568274,1.0000352383006914,8.3949110705276511E-3,1,0,1,0,0.99999125096845365,4.3978896925060476E-3,51.943645685864112,-103.4529707056755,76.547029294324503,null,1000000000,831762.24009999994,null,48.22151735560535,-82.425116001536651,null,61.692975515083219,-21.027854704138829,null,0,0]
[1000,1,1.0944727826974199,0.41854337387191631,1.0003123140231243,2.4989308169973082E-2,1,0,329.8945552144998,1.567765050541214,1.0114072795272919,0.15033220783720128,1.0000423656826636,9.2048016826557465E-3,1,0,1,0,0.99998948136311949,4.8222062726579135E-3,51.03807386758195,-104.56559507962577,75.434404920374234,null,1000000000,1000000,null,47.43787497221944,-81.740316011243621,null,61.571046080186974,-22.825279068382144,null,0,0]
[1096.5,1.0965,1.1126105935771076,0.45380155107773562,1.0003754871173594,2.739962272905978E-2,1,0,361.72910014672681,1.5680318235427615,1.0136994998247928,0.16458985197264464,1.0000509365609653,1.0093007376214881E-2,1,0,1,0,0.99998735336021449,5.2875645760745472E-3,50.115299077997378,-105.7235746132761,74.276425386723901,null,1000000000,1202312.25,null,46.657297666563871,-80.989588580282586,null,61.428848596257964,-24.733986032993506,null,0,0]
[1202.3,1.2022999999999999,1.1340313314101516,0.49111014604127878,1.0004514264242435,3.0041859733452421E-2,1,0,396.63166209872816,1.5682750932298659,1.0164482881855714,0.18014412469242005,1.0000612400877955,1.1066793814704138E-2,1,0,1,0,0.9999847951666655,5.7977757827211204E-3,49.173696373315927,-106.91758156477911,73.082418435220887,null,1000000000,1445525.2899999998,null,45.880650670710132,-80.16812657853238,null,61.263892887430259,-26.749454986246718,null,0,{"$f":"IF(AH90>0,W90,0)","v":0}]
[1318.3,1.3183,1.1592594132793679,0.53037053459283612,1.0005427126807684,3.2938346857130804E-2,1,0,434.8991437653695,1.5684969410740182,1.0197430607012135,0.19709701669508251,1.0000736267999226,1.2134437175656191E-2,1,0,1,0,0.99998171974786465,6.3571820532729835E-3,48.21138240410167,-108.13568450443204,71.864315495567965,null,1000000000,1737914.89,null,45.108629030426997,-79.270679818984974,null,61.07360055849913,-28.865004685447069,null,0,0]
[1445.4,1.4454,1.1888598236106904,0.57140481939764509,1.0006523696694389,3.6111361414508866E-2,1,0,476.82844799831935,1.5686991349489949,1.023687258782161,0.21554093406305908,1.0000885075441432,1.3304211111410185E-2,1,0,1,0,0.99997802509409706,6.9701262230239267E-3,47.227295440965456,-109.36194395432872,70.638056045671277,null,1000000000,2089181.1600000001,null,44.342558468464091,-78.292529160176841,null,60.855584157325822,-31.069414794151882,null,0,0]
[1584.9,1.5849000000000002,1.2235329689490375,0.61407754751453203,1.0007843190239709,3.9593098806655305E-2,1,0,522.84843472370881,1.5688837254686583,1.0284137971854437,0.23561379290553788,1.0001064152897754,1.4588067300869912E-2,1,0,1,0,0.99997357887293226,7.6428810501620505E-3,46.218362142575884,-110.58001403586337,69.419985964136629,null,1000000000,2511908.0100000002,null,43.582141784544213,-77.226574863395541,null,60.607067542856129,-33.353439172467816,null,0,0]
[1737.8,1.7378,1.2639459270767981,0.65807161660058033,1.0009428751480567,4.3408176626552206E-2,1,0,573.28899633493666,1.5690520049720411,1.034065653183549,0.25739424380691162,1.0001279367204929,1.5995191911621524E-2,1,0,1,0,0.99996823541312851,8.3802737189263236E-3,45.184989783017173,-111.76668624385373,68.233313756146273,null,1000000000,3019948.84,null,42.829603369463108,-76.068910956299547,null,60.326233598378522,-35.697775287554165,null,0,0]
[1905.5,1.9055,1.3108983975847299,0.70310899240993208,1.0011335250750708,4.7591078516096223E-2,1,0,628.61198231429864,1.5692055196675867,1.0408220554622156,0.28099847408631157,1.0001538182672052,1.7538446514830192E-2,1,0,1,0,0.99996180937716872,9.1890620378332656E-3,44.126050805708353,-112.8986102781337,67.101389721866298,null,1000000000,3630930.25,null,42.085765083931122,-74.813705900826747,null,60.011132906601688,-38.084904377306977,null,0,0]
[2089.3000000000002,2.0893000000000002,1.365188635324506,0.74880999331131692,1.0013625897708369,5.217364006167776E-2,1,0,689.24625301500464,1.5693454660227726,1.0488839564011745,0.30650373177496765,1.0001849204168536,1.9229764691701342E-2,1,0,1,0,0.99995408710410594,1.0075523602560475E-2,43.042546241738989,-113.94889392885069,66.051106071149306,null,1000000000,4365174.4900000012,null,41.352678925610967,-73.457286007182077,null,59.66071450095248,-40.491607921668617,null,0,0]
[2290.9,2.2909000000000002,1.4277497590837964,0.79483457162354676,1.0016380080008938,5.7197468997443393E-2,1,0,755.75262595528761,1.5694731421211563,1.0584983795969214,0.33401234602170299,1.0002223245379058,2.1084750676823357E-2,1,0,1,0,0.99994480008387432,1.1047867904060192E-2,41.934652211444849,-114.89124572377619,65.108754276223806,null,1000000000,5248222.8100000005,null,40.631504181940592,-71.994756678505013,null,59.273995214328721,-42.896489045271174,null,0,0]
[2511.9,2.5119000000000002,1.4994975911493573,0.84076895125719298,1.0019689588775373,6.2701413548012855E-2,1,0,828.65892949375154,1.5695895573905938,1.0699405309241008,0.36357522658129604,1.0002672822167125,2.3118075055458723E-2,1,0,1,0,0.99993363753306053,1.2113825735700082E-2,40.804820508254394,-115.69815662630054,64.301843373699455,null,1000000000,6309641.6100000003,null,39.924579625802991,-70.424099399282753,null,58.851088067275867,-45.274057227017771,null,0,0]
[2754.2,2.7542,1.5814459397836553,0.886235673499979,1.0023666641641569,6.8731448238598752E-2,1,0,908.59195990024682,1.569695722512642,1.0835356975629102,0.3952391097530355,1.0003213250523764,2.5347151101105029E-2,1,0,1,0,0.99992021912927487,1.3282579570712548E-2,39.655553375506557,-116.34426963811005,63.655730361889951,null,1000000000,7585617.6399999987,null,39.23392054454051,-68.743691991680734,null,58.392480015790511,-47.600577646429329,null,0,0]
[3020,3.02,1.6747118192410242,0.93089329795316123,1.0028448270980261,7.5340549887745717E-2,1,0,996.27748138548168,1.569792590198819,1.0996657245776582,0.4290358484813141,1.0003863255333367,2.7792128435083541E-2,1,0,1,0,0.9999040798888168,1.4564765261849617E-2,38.489677766858421,-116.80697974206606,63.193020257933938,null,1000000000,9120400,null,38.561476959406768,-66.952918491029024,null,57.89904799227611,-49.854061251037017,null,0,0]
[3311.3,3.3113000000000001,1.780335384027776,0.97436694734728213,1.0034191215241111,8.2576120884477869E-2,1,0,1092.3752796636541,1.5698808903525976,1.1187411518979935,0.46491022740574189,1.0004644293192066,3.0471286317438458E-2,1,0,1,0,0.99988468697076782,1.5970062098376234E-2,37.312453545666713,-117.0668994303209,62.933100569679098,null,1000000000,10964707.690000001,null,37.910346354677905,-65.056031649288755,null,57.372954375813265,-52.010867781032168,null,0,0]
[3630.8,3.6308000000000002,1.8995976990509331,1.0164033971424657,1.0041093443366198,9.050216846043882E-2,1,0,1197.776065530054,1.5699614460981208,1.1412594351227547,0.50282443401685384,1.0005583504038025,3.3409302044386892E-2,1,0,1,0,0.99986136637499334,1.751153706133925E-2,36.127637258741913,-117.11022890775592,62.889771092244075,null,1000000000,13182708.640000001,null,37.282550992425058,-63.056659030131641,null,56.815933451141312,-54.053569877624298,null,0,0]
[3981.1,3.9811000000000001,2.0337363125079446,1.0567486461190636,1.0049384926602933,9.9179171377561326E-2,1,0,1313.3375605623678,1.570034907852307,1.167755933823289,0.54264977775731027,1.0006712493004721,3.6629879490242045E-2,1,0,1,0,0.99983333316714584,1.9201789117447247E-2,34.94074940560612,-116.92844049019334,63.071559509806661,null,1000000000,15849157.209999999,null,36.680910315571282,-60.963569457467045,null,56.230686274859295,-55.964871032726307,null,0,0]
[4365.2,4.3651999999999997,2.1841291000927976,1.0952228129233905,1.0059344550987659,0.10867616872913005,1,0,1440.0494435640596,1.5701019061381343,1.1988370655499927,0.58422151869820538,1.0008069683576983,4.016033033181355E-2,1,0,1,0,0.99979963302007746,2.1055366019255343E-2,33.756935816377386,-116.51914548416916,63.480854515830842,null,1000000000,19054971.039999999,null,36.107873154578414,-58.787802804069344,null,55.619909846623429,-57.7313426800998,null,0,0]
[4786.3,4.7862999999999998,2.3522230914485949,1.1316911037760247,1.0071303941664833,0.11906537368991942,1,0,1578.967371981526,1.5701630014427741,1.2351648334403356,0.62731143152544999,1.0009700913657962,4.4029712317829324E-2,1,0,1,0,0.99975912737006434,2.3087805475390827E-2,32.581568497438603,-115.88614685719898,64.11385314280102,null,1000000000,22908667.690000001,null,35.565837629110646,-56.544132417144404,null,54.986578053152414,-59.342014440054562,null,0,0]
[5248.1,5.2481,2.5396581646373071,1.1660846133683556,1.0085665758650466,0.1304290184310235,1,0,1731.3119497930265,1.5702187301025601,1.2774800268115483,0.67165782427510945,1.0011662037877418,4.8271555911883597E-2,1,0,1,0,0.99971042873681937,2.5317091211466466E-2,31.419272855492526,-115.03876119008106,64.961238809918939,null,1000000000,27542553.610000003,null,35.056676627760908,-54.249504025634941,null,54.333443412556079,-60.789257164446099,null,0,0]
[5370.3,5.3703000000000003,2.5897131772452058,1.1743495577079657,1.008968365302686,0.13343049103312363,1,0,1771.6248726575755,1.570231873185933,1.2890801057524715,0.68289836950148508,1.001221111785312,4.9393734091415918E-2,1,0,1,0,0.99969679373699472,2.5907073831286289E-2,31.131433400351348,-114.79515273590879,65.204847264091214,null,1000000000,28840122.090000004,null,34.934787171288555,-53.670517340832035,null,54.167493413887243,-61.124635395076787,null,0,0]
[5432.85,5.4328500000000002,2.6154010937440808,1.1784575468054115,1.0091775425540275,0.1349659103638772,1,0,1792.2596790336452,1.5702383719049977,1.2950799560084885,0.68857373986827408,1.0012497051279614,4.9968090723387412E-2,1,0,1,0,0.99968969326744617,2.6209078635552753E-2,30.987065112428049,-114.6679595175064,65.332040482493596,null,1000000000,29515859.122500002,null,34.874289324475043,-53.37862313142984,null,54.083622972777469,-61.289336386076542,null,0,0]
[5495.4,5.4954000000000001,2.6411322876592673,1.1824855587280274,1.0093890979647215,0.13650068970201443,1,0,1812.8944854836845,1.570244722684057,1.3011211350748915,0.69419658781979632,1.001278628749483,5.0542414362291323E-2,1,0,1,0,0.9996825107513726,2.6511092297342727E-2,30.844651308537479,-114.53922006692477,65.46077993307523,null,1000000000,30199421.159999996,null,34.815029538072856,-53.089727868054226,null,54.000468955289087,-61.449492198870537,null,0,0]
[5559.4,5.5593999999999992,2.66750345568125,1.1865264459067697,1.009608017470327,0.13807037791999649,1,0,1834.0076368414561,1.5702510727678891,1.3073445368513117,0.69989580999805778,1.0013085646849076,5.1130017117333539E-2,1,0,1,0,0.99967507681898704,2.6820116349583902E-2,30.700917370779678,-114.40600472509824,65.593995274901758,null,1000000000,30906928.359999996,null,34.75564411517081,-52.797217481295561,null,53.916120440433332,-61.608787243802674,null,0,0]
[5623.4,5.6233999999999993,2.6939173275681831,1.1904881548880637,1.0098294234882923,0.13963938169134066,1,0,1855.120788271498,1.5702572783109645,1.3136099995019639,0.70554084746941215,1.0013388463284061,5.171758453566682E-2,1,0,1,0,0.9996675570050747,2.7129149891022941E-2,30.559145910905219,-114.27138681512186,65.728613184878142,null,1000000000,31622627.559999995,null,34.697488179698368,-52.507801343340752,null,53.832504916031311,-61.763585471781091,null,0,0]
[5688.9,5.6888999999999994,2.7209931937085554,1.1944630112458203,1.0100585916151417,0.14124444270259537,1,0,1876.728779260467,1.5702634847250296,1.3200652350697055,0.71126251845424637,1.0013701956220187,5.2318886056657951E-2,1,0,1,0,0.99965977202811906,2.7445436345630677E-2,30.41604124528596,-114.1322680070993,65.867731992900701,null,1000000000,32363583.209999997,null,34.639208776074156,-52.214781384511895,null,53.747679654036268,-61.917486622587425,null,0,0]
[5754.4,5.7543999999999995,2.7481112026164665,1.1983594814124645,1.0102903606915805,0.14284877141648558,1,0,1898.3367703200813,1.5702695498489492,1.3265632648909214,0.71692831941638957,1.0014019069518179,5.2920149712279464E-2,1,0,1,0,0.99965189711102809,2.7761732971263813E-2,30.274907048795324,-113.99189139310425,66.008108606895746,null,1000000000,33113119.359999996,null,34.58215025247641,-51.92495227733329,null,53.663603981143368,-62.066939115770992,null,0,0]
[5821.4,5.8213999999999997,2.7758925484909693,1.2022663577807593,1.0105301265681934,0.1444890747566154,1,0,1920.4396009402149,1.5702756126601221,1.3332537277241967,0.72266654296516308,1.001434719026898,5.353514313913342E-2,1,0,1,0,0.99964374880671036,2.8085283676389645E-2,30.132536343916044,-113.847102461305,66.152897538695001,null,1000000000,33888697.959999993,null,34.525014595583542,-51.631760187030167,null,53.578368933156959,-62.215342274274803,null,0,0]
[5888.4,5.8883999999999999,2.8037154246611866,1.2060957512876325,1.0107726100779777,0.1461285954914586,1,0,1942.5424316293327,1.5702815375023254,1.3399876516615845,0.72834727869676785,1.001467909836625,5.4150096034139061E-2,1,0,1,0,0.99963550641132071,2.8408845271911305E-2,29.992141048826685,-113.7012031344677,66.298796865532296,null,1000000000,34673254.559999995,null,34.469089291115786,-51.341851678684492,null,53.493898942535353,-62.359351455783205,null,0,0]
[5957,5.9569999999999999,2.8322444792853769,1.2099385817894737,1.0110236979526241,0.14780644948468447,1,0,1965.173091180071,1.5702874657446182,1.3469267352494474,0.73410463087376554,1.0015022856326308,5.4779691894615637E-2,1,0,1,0,0.99962696970267717,2.8740145126183819E-2,29.850395980042691,-113.55077010234267,66.449229897657332,null,1000000000,35485849,null,34.41304879646831,-51.048392546304271,null,53.408194368398838,-62.502377556038368,null,0,0]
[6025.6,6.0256000000000007,2.8608145241063352,1.2137047127335121,1.0112776306371019,0.14948346557590333,1,0,1987.8037507983011,1.5702932590037337,1.3539100070515571,0.73980277913415238,1.0015370583877328,5.5409244286259068E-2,1,0,1,0,0.99961833437255931,2.9071456663495435E-2,29.710634044885008,-113.39937309690676,66.600626903093243,null,1000000000,36307855.360000007,null,34.358209780626169,-50.75831532393331,null,53.3232714490833,-62.64105777297344,null,0,0]
[6095.8,6.0958000000000006,2.8900920927812677,1.2174815430654744,1.0115404288248975,0.15119871912173063,1,0,2010.9622392797853,1.5702990523947709,1.3611011905575507,0.74557310528130716,1.0015730530809039,5.6053434598288855E-2,1,0,1,0,0.99960939554592598,2.9410507819116589E-2,29.569620960709603,-113.24354493426455,66.756455065735452,null,1000000000,37158777.640000001,null,34.303301733091345,-50.464941311890144,null,53.237166412442718,-62.778603622374426,null,0,0]
[6166,6.1660000000000004,2.9194100598150632,1.2211825682132207,1.0118062015094,0.15291307661261186,1,0,2034.1207278272273,1.5703047138701571,1.3683372169650825,0.75128259071245163,1.001609463378047,5.6697578342667816E-2,1,0,1,0,0.99960035346257226,2.9749571494582544E-2,29.430595562196412,-113.08690120191159,66.913098798088413,null,1000000000,38019556,null,34.249584297913536,-50.175042989760996,null,53.151858449107337,-62.911858212150584,null,0,0]
[6237.8,6.2378,2.9494367769350225,1.2248917828349368,1.012081106209874,0.15466557109320031,1,0,2057.8070452393804,1.5703103725643131,1.3757838171677848,0.75705988612123276,1.0016471334128725,5.7356354702320173E-2,1,0,1,0,0.99959099848825939,3.0096376218692295E-2,29.29041263235812,-112.92593813492948,67.074061865070519,null,1000000000,38910148.840000004,null,34.195840289928903,-49.882097669846551,null,53.065419527253681,-63.043840465082944,null,0,0]
[6309.6,6.3096000000000005,2.9795032549959117,1.2285261864795625,1.0123591175574935,0.15641710842005063,1,0,2081.4933627159262,1.5703159024724462,1.3832758418140634,0.76277478920676112,1.001685238116018,5.8015081227342488E-2,1,0,1,0,0.99958153551734241,3.0443194345400711E-2,29.152218900845497,-112.76430890606687,67.235691093933127,null,1000000000,39811052.160000004,null,34.143274166495353,-49.592716932523054,null,52.979791919174602,-63.171591973543812,null,0,0]
[6383.05,6.3830499999999999,3.010300575611613,1.2321689396863684,1.0126467296331807,0.15820789617391992,1,0,2105.7240037085953,1.570321430732627,1.3909862738717889,0.76855712933631004,1.0017246681990633,5.8688893462471782E-2,1,0,1,0,0.99957174334582177,3.0797996555785363E-2,29.012862152385107,-112.5983670374528,67.401632962547197,null,1000000000,40743327.302500002,null,34.090684958872195,-49.300336590290264,null,52.893024378337373,-63.298030447162546,null,0,0]
[6456.5,6.4565000000000001,3.0411370325078719,1.2357378660312528,1.0129375873364657,0.15999766124118392,1,0,2129.9546447641546,1.5703268332123945,1.3987427005460475,0.77427552945874201,1.0017645530521524,5.9362652348356172E-2,1,0,1,0,0.99956183817961397,3.1152813118944949E-2,28.875495896149971,-112.43190784839149,67.568092151608511,null,1000000000,41686392.25,null,34.039260743402849,-49.011609477238096,null,52.807082337571572,-63.420298371153386,null,0,0]
[6531.7,6.5316999999999998,3.0727475062201886,1.2393175659175308,1.01323873456145,0.16182899819622937,1,0,2154.7625986375515,1.570332238529893,1.4067307867072805,0.78006464865569458,1.0018058592862951,6.0052408129651506E-2,1,0,1,0,0.99955157996267574,3.1516098488911799E-2,28.736872853120392,-112.26103408362997,67.738965916370034,null,1000000000,42663104.890000001,null,33.987784323304851,-48.719747176863606,null,52.719935714640002,-63.541286906766338,null,0,0]
[6606.9,6.6068999999999996,3.1043965527304502,1.2428243205368612,1.0135432779554683,0.16365924074822666,1,0,2179.5705525724725,1.5703375208003378,1.4147654846062498,0.78578820304596897,1.0018476421032021,6.0742106705479651E-2,1,0,1,0,0.99954120332733754,3.1879399254669732E-2,28.600243903884333,-112.08979070872459,67.910209291275407,null,1000000000,43651127.609999992,null,33.937461279207078,-48.431631135491962,null,52.633629809501727,-63.658159573232624,null,0,0]
[6683.85,6.6838500000000005,3.1368208246565503,1.2463393852746696,1.0138584209085928,0.16553093072252126,1,0,2204.9558193267085,1.5703428029530511,1.4230345879383226,0.7915778514300621,1.0018908905452373,6.1447795552813357E-2,1,0,1,0,0.99953046264367473,3.2251170615635656E-2,28.462452986452661,-111.91426329694447,68.085736703055531,null,1000000000,44673850.822500005,null,33.887127125199022,-48.140644355545078,null,52.546173046078096,-63.773618941399384,null,0,0]
[6760.8,6.7608000000000006,3.1692830608204834,1.2497824838349907,1.0141771134196267,0.16740145093578299,1,0,2230.3410861410653,1.570347964865092,1.4313508393635317,0.79730041323826517,1.001934637882461,6.2153423126727558E-2,1,0,1,0,0.99951959799318046,3.2622958473445714E-2,28.326656625735531,-111.73851387216526,68.261486127834743,null,1000000000,45708416.640000001,null,33.837932827871825,-47.853490953271667,null,52.459570982688163,-63.885022918893561,null,0,0]
[6839.55,6.83955,3.2025427496281962,1.2532338113513448,1.0145069323105143,0.16931450238173718,1,0,2256.3201604264127,1.5703531272657356,1.439909585870274,0.80308820260877145,1.0019799250177952,6.2875492443902045E-2,1,0,1,0,0.99950835086295442,3.3003460401967145E-2,28.189701650048271,-111.55850315763865,68.441496842361346,null,1000000000,46779444.202500001,null,33.788733973978211,-47.563542357458694,null,52.371814860894531,-63.994960800179939,null,0,0]
[6918.3,6.9183000000000003,3.23583980157672,1.2566141495700249,1.014840461637962,0.17122630336433003,1,0,2282.2992347705231,1.5703581721406945,1.4485159962570875,0.80880740495463888,1.0020257345221493,6.3597496115956276E-2,1,0,1,0,0.99949697392827375,3.3383980011341061E-2,28.054741219855064,-111.37841696740301,68.621583032596988,null,1000000000,47862874.890000001,null,33.740661110307322,-47.277513013777302,null,52.284927294372203,-64.100903953625703,null,0,0]
[6998.9,6.9988999999999999,3.2699565688675363,1.2600025723297796,1.0151856646498114,0.1731817083336282,1,0,2308.8886112373698,1.5703632179708515,1.4573730643084855,0.81459082158472229,1.0020731610319686,6.4336392391542652E-2,1,0,1,0,0.99948519532760494,3.3773457333155239E-2,27.918628010001918,-111.19409762410035,68.805902375899649,null,1000000000,48984601.209999993,null,33.692590931311372,-46.988772392238992,null,52.196884263515003,-64.205325231861352,null,0,0]
[7079.5,7.0795000000000003,3.3041101042989163,1.2633209824391272,1.0155347466867033,0.17513577646027534,1,0,2335.4779877616634,1.5703681489076307,1.4662782885932293,0.82030417793886556,1.0021211345894145,6.5075218325565717E-2,1,0,1,0,0.99947328078482145,3.4162953608619838E-2,27.784508791811511,-111.00984807776543,68.990151922234574,null,1000000000,50119320.25,null,33.645632483999883,-46.704035315647786,null,52.109723492636093,-64.305812762117611,null,0,0]
[7161.95,7.16195,3.3390844282359318,1.2666452828476458,1.0158958505819864,0.17713329869189681,1,0,2362.6776664099989,1.570373078188422,1.4754368309458374,0.82607711866682765,1.0021707752211715,6.5830928810815897E-2,1,0,1,0,0.99946095212852792,3.4561409774285151E-2,27.649326255955664,-110.82151303328264,69.178486966717358,null,1000000000,51293527.802499995,null,33.598712609392358,-46.416851624552223,null,52.021460831387756,-64.404661408730419,null,0,0]
[7244.4,7.2443999999999997,3.3740948870907466,1.2699006310540661,1.016261005108217,0.17912939341693968,1,0,2389.8773451144357,1.5703778952669252,1.4846439373385745,0.83177864499364362,1.0022209881341051,6.658656400290619E-2,1,0,1,0,0.99944848125384234,3.4959886236626055E-2,27.516134169072707,-110.63339127273207,69.366608727267931,null,1000000000,52481331.359999992,null,33.552888469566099,-46.133748934545594,null,51.934092884331065,-64.499642338186476,null,0,0]
[7328.75,7.3287500000000003,3.4099483693222985,1.2731617863178581,1.0166387615241703,0.18116999448337531,1,0,2417.7038205946437,1.5703827111898772,1.4941125341602046,0.83753865079508705,1.0022729502920571,6.7359533452099149E-2,1,0,1,0,0.9994355758440705,3.5367566545650236E-2,27.381884129568942,-110.44122203458298,69.558777965417022,null,1000000000,53710576.5625,null,33.507108453984266,-45.848288731016744,null,51.845622860409136,-64.592933303566241,null,0,0]
[7413.1,7.4131,3.4458373619178873,1.2763550439624252,1.017020748122424,0.18320907116148619,1,0,2445.5302961296493,1.5703874175168351,1.5036300768823914,0.84322592497041782,1.0023255112275262,6.8132422295567596E-2,1,0,1,0,0.99942252162504031,3.5775268593325721E-2,27.249620515058727,-110.24940745342172,69.750592546578275,null,1000000000,54954051.610000007,null,33.462407854346871,-45.566984844950305,null,51.758059845536323,-64.682422608471413,null,0,0]
[7499.45,7.4994499999999995,3.4826129458342021,1.2795558091303201,1.0174161687491219,0.18529490090114956,1,0,2474.0165577428415,1.5703921257704128,1.5134230238382504,0.84897376196129803,1.0023799385647616,6.8923552451095049E-2,1,0,1,0,0.99940900375841513,3.6192660333497301E-2,27.116229668881715,-110.0534747138901,69.946525286109903,null,1000000000,56241750.302499995,null,33.4177317719695,-45.283256225735606,null,51.66934508173668,-64.77021848815447,null,0,0]
[7585.8,7.5857999999999999,3.5194234629102477,1.2826896506640844,1.0178160123832203,0.18737910088825585,1,0,2502.502819409629,1.5703967268348658,1.5232653268571852,0.85464750717505578,1.0024349932101362,6.9714596202499979E-2,1,0,1,0,0.99939532998524927,3.6610075387184672E-2,26.98482296462754,-109.85803630033261,70.141963699667386,null,1000000000,57544361.640000001,null,33.374119650329263,-45.003761660575506,null,51.581550499122741,-64.854274639757108,null,0,0]
[7674.15,7.67415,3.5571215937260554,1.2858289139834918,1.0182296894407659,0.18950987049880946,1,0,2531.6488671558668,1.5704013272991224,1.5333856856353847,0.86037709023081088,1.0024919721692767,7.0523871307943867E-2,1,0,1,0,0.99938117816451622,3.7037182831600776E-2,26.852377155620722,-109.65864089497946,70.341359105020544,null,1000000000,58892578.222499996,null,33.330565023780935,-44.722112367981879,null,51.492659316664238,-64.936528526997577,null,0,0]
[7762.5,7.7625000000000002,3.5948540444551149,1.288902306141388,1.018647985676469,0.1916388998162348,1,0,2560.7949149544656,1.5704058230417159,1.5435557215425855,0.86603135579257928,1.0025496076117908,7.1333053894671941E-2,1,0,1,0,0.99936686317882273,3.7464315251805977E-2,26.721910255969963,-109.45987656602715,70.540123433972852,null,1000000000,60256406.25,null,33.288057236824471,-44.44476714888085,null,51.404700203969952,-65.015109417146306,null,0,0]
[7852.9,7.8529,3.6334964160080956,1.2919809101646396,1.019080762968039,0.19381551014522141,1,0,2590.6172434843897,1.5704103183919382,1.5540121366540152,0.87174002820172714,1.0026092597699674,7.2160915229597944E-2,1,0,1,0,0.99935204717767767,3.7901384650238991E-2,26.590415030562792,-109.25720691895044,70.742793081049555,null,1000000000,61668038.409999996,null,33.245613261647733,-44.165374838003139,null,51.315648953739519,-65.091832080947299,null,0,0]
[7943.3,7.9432999999999998,{"$f":"SQRT(1+(A141/pole1)^2)","v":3.6721725001604848},{"$f":"ATAN(A141/pole1)","v":1.294994693257713},{"$f":"SQRT(1+(A141/Zero1)^2)","v":1.0195183641775207},{"$f":"ATAN(A141/Zero1)","v":0.19599026226557734},{"$f":"IF(VIN_nom>Vout, 1, SQRT(1+(A141/z_RHP)^2))","v":1},{"$f":"IF(VIN_nom>Vout, 0, -ATAN(A141/z_RHP))","v":0},{"$f":"SQRT(1+(A141/Pole2)^2)","v":2620.4395720654738},{"$f":"ATAN(A141/Pole2)","v":1.5704147114220668},{"$f":"SQRT(1+(A141/Zero2)^2)","v":1.5645185174693086},{"$f":"ATAN(A141/Zero2)","v":0.87737220997981835},{"$f":"SQRT(1+(A141/pole4)^2)","v":1.002669598988766},{"$f":"ATAN(A141/pole4)","v":7.2988677492761625E-2},{"$f":"IF(VOUT_setting=1,1,SQRT(1+(A141*zterm1)^2))","v":1},{"$f":"IF(VOUT_setting=1,0,ATAN(((A141*zterm1))))","v":0},1,{"$f":"IF(VOUT_setting=1,0,ATAN(A141*$Q$4/(1+Afbr-$Q$5*(A141)^2)))","v":0},{"$f":"SQRT((1-(Z141/pterm2))^2+(A141/pterm1)^2)","v":0.99933706040368542},{"$f":"IF((ATAN((A141/pterm1)/(1-A141^2/pterm2))>0),ATAN((A141/pterm1)/(1-A141^2/pterm2)),PI()+ATAN((A141/pterm1)/(1-A141^2/pterm2)))","v":3.8338480807429402E-2},{"$f":"20*LOG10(((E141*K141*G141*O141)/(C141*I141*S141*M141*Q141))*Adc)","v":26.460892884915634},{"$f":"((F141+L141+H141+P141)-(D141+J141+T141+N141+R141))*radconv","v":-109.05530235825562},{"$f":"IF(V141>0,V141,V141+180)","v":70.944697641744384},null,{"$f":"IF(U141<0,A141,1000000000)","v":1000000000},{"$f":"A141^2","v":63096014.890000001},null,{"$f":"20*LOG10((K141/(I141*M141))*AEA)","v":33.204198625585079},{"$f":"(L141-(J141+N141))*radconv","v":-43.890353578558894},null,{"$f":"20*LOG10((E141*G141/(C141*S141))*Acs*Am)","v":51.227541444155015},{"$f":"(F141+H141-(D141+T141))*radconv","v":-65.164948779696715},null,{"$f":"SUM((U142<0)*(U141>0))*A141","v":0},0]
[8035.8,{"$f":"A142/1000","v":8.0358000000000001},3.7117808302908966,1.2980134471516951,1.0199711177343156,0.19821359166160624,1,0,2650.9546760297958,1.5704191041917499,1.5753196398228237,0.88305727881536267,1.0027320509502899,7.383556503138429E-2,1,0,1,0,0.99932154874391033,3.8785758767521536E-2,26.330354658369693,-108.8495482823875,71.150451717612498,null,1000000000,64574081.640000001,null,33.162854163058341,-43.613397896572891,null,51.138347680135809,-65.236150385814611,null,0,0]
[8128.3,8.1282999999999994,3.7514222709754721,1.3009684288971934,1.0204289087171949,0.20043493714307187,1,0,2681.4697800441077,1.5704233969820673,1.5861709821586398,0.88866474123095607,1.0027952219999159,7.4682346477969633E-2,1,0,{"$f":"IF(VOUT_setting=1,1,SQRT((1+Afbr-$Q$5*(A143)^2)^2+(A143*$Q$4)^2))","v":1},0,0.99930585834184271,3.9233065398153431E-2,26.201783060923201,-108.64469035749879,71.355309642501211,null,1000000000,66069260.890000001,null,33.12252115334492,-43.340876927896602,null,51.050109092402735,-65.303813429602172,null,0,0]
[8222.9500000000007,8.2229500000000009,3.7920182979792441,1.30392811456958,1.0209025475937263,0.20270584021083493,1,0,2712.6941540936036,1.5704276895782241,1.5973254616472288,0.89432349206861583,1.0028606055611071,7.5548698806396392E-2,1,0,1,0,0.99928961825205775,3.9690798908622558E-2,26.072208932011321,-108.43604263111799,71.563957368882015,null,1000000000,67616906.702500015,null,33.082264626760363,-43.066538666902225,null,50.960791490075408,-65.369503964215767,null,0,0]
[8270.2750000000015,8.2702750000000016,3.8123285688958997,1.3053843136169485,1.0211413399538178,0.20384049882962282,1,0,2728.3063411367743,1.5704297990310188,1.602921681772931,0.8971232889332742,1.0028935795815785,7.5981832446738853E-2,1,0,1,0,0.99928142804805908,3.9919677161603079E-2,26.008159728628222,-108.33210034687794,71.667899653122063,null,1000000000,68397448.575625017,null,33.062510799983116,-42.93105971520751,null,50.916496113469563,-65.401040631670426,null,0,0]
[8317.6,8.3176000000000005,3.8326468382252155,1.3068250759999813,1.0213814463668034,0.20497462543673634,1,0,2743.9185281919467,1.5704318844793315,1.6085303794939652,0.89990358254491709,1.0029267417372572,7.6414937524870982E-2,1,0,1,0,0.99927319107664547,4.0148563138834505E-2,25.944594343612057,-108.22841897374748,71.77158102625252,null,1000000000,69182469.760000005,null,33.043001280575858,-42.796695205749018,null,50.872440247860659,-65.431723767998463,null,0,0]
[8366.0499999999993,8.3660499999999995,3.8534562629734168,1.3082843451898263,1.0216286208520404,0.20613515847846944,1,0,2759.9018449040746,1.5704339950606261,1.614285196246245,0.90272993213492725,1.002960887094108,7.6858308530885475E-2,1,0,1,0,0.99926470985362215,4.0382898193772165E-2,25.880012897195279,-108.1225480156087,71.8774519843913,null,1000000000,69990792.602499992,null,33.023277007375029,-42.660281517460625,null,50.827583074644707,-65.462266498148068,null,0,0]
[8414.5,8.4145000000000003,3.8742738053680381,1.3097279353140978,1.0218771706377177,0.20729512853213455,1,0,2775.8851616283559,1.5704360813368161,{"$f":"SQRT(1+(A148/Zero2)^2)","v":1.6200528166411106},{"$f":"ATAN(A148/Zero2)","v":0.90553617958939847},1.0029952295974063,7.730164926204669E-2,1,0,1,0,0.99925617962181867,4.061724143857013E-2,25.815926043105385,-108.01696007959517,71.983039920404835,null,1000000000,70803810.25,null,33.003800614872645,-42.525016469497899,null,50.782972613057197,-65.491943610097252,null,0,0]
[8462.9500000000007,8.4629500000000011,3.8950993352536454,1.3111560917962961,1.0221270947205432,0.2084545328880287,1,0,2791.8684783645808,1.5704381437253387,1.6258331044163343,0.90832249487987227,1.0030297692269015,7.774495954719518E-2,1,0,1,0,0.99924760038560023,4.0851592920786689E-2,25.752327612234531,-107.91165966087576,72.088340339124244,null,1000000000,71621522.702500015,null,32.984568082560216,-42.390890337319547,null,50.738606714498779,-65.520769323556223,null,0,0]
[8511.4,8.5114000000000001,3.9159327251941396,1.3125690550919988,1.0223783920926612,0.20961336884517454,1,0,2807.851795112545,1.5704401826341257,1.6316259249434457,0.91108904680995118,1.0030645059622303,7.8188239215242886E-2,1,0,1,0,0.99923897214935686,4.1085952687982381E-2,25.689211537238222,-107.80665103585608,72.193348964143922,null,1000000000,72443929.959999993,null,32.965575466683525,-42.257893462761672,null,50.694483255379161,-65.548757573094392,null,0,0]
[8560.9500000000007,8.5609500000000001,3.9372471123670301,1.3139986290424592,1.0226368142311808,0.2107979240953114,1,0,2824.1979941928325,1.5704422439639647,1.637563088800569,0.91389814320755713,1.0031002352019645,7.8641551178458752E-2,1,0,1,0,0.99923009734242152,4.1325641935598158E-2,25.625155175053113,-107.69956435541386,72.300435644586145,null,1000000000,73289864.902500018,null,32.946395763420931,-42.123035062574374,null,50.649606596456643,-65.576529292839496,null,0,0]
[8610.5,8.6105,3.9585694593597927,1.3154128054090257,1.0228966705779543,0.21198187915795577,1,0,2840.5441932849812,1.5704442815695416,1.6435130812843899,0.91668692199691415,1.0031361705557991,7.9094830756819209E-2,1,0,1,0,0.99922117129459742,4.1565339949290868E-2,25.56159080131318,-107.59279124725647,72.407208752743529,null,1000000000,74140710.25,null,32.927458889431371,-41.989337560775226,null,50.604979096706266,-65.603453686481259,null,0,0]
[8660.0499999999993,8.66005,3.9798996382380194,1.3168118260583357,1.0231579600402239,0.21316523117245789,1,0,2856.8903923887883,1.5704462958580836,1.6494757635685655,0.9194555599023333,1.0031723120015839,7.9548077767550782E-2,1,0,1,0,0.99921219401066308,4.180504677994188E-2,25.49851224345182,-107.48633562344298,72.513664376557017,null,1000000000,74996466.002499983,null,32.908760864425744,-41.85679084466733,null,50.560598563850533,-65.629544778775667,null,0,0]
[8709.6,8.7096,4.0012375237488236,1.3181959279378608,1.0234206815203233,0.21434797728783694,1,0,2873.2365915040555,1.5704482872275509,1.6554509985329195,0.92220423233986781,1.0032086595170453,8.0001292027959747E-2,1,0,1,0,0.99920316549542476,4.2044762478435006E-2,25.435913431752386,-107.38020118806246,72.619798811937542,null,1000000000,75857132.160000011,null,32.890297784889128,-41.725384875985021,null,50.516462831687718,-65.654816312077429,null,0,{"$f":"IF(AH154>0,W154,0)","v":0}]
[8760.3250000000007,8.7603249999999999,4.0230892584176221,1.3195976403247249,1.0236911152318156,0.2155581397717945,1,0,2889.97041492888,1.5704503024844783,1.6615807880800118,0.92499758570895463,1.0032460823905915,8.0465219433713292E-2,1,0,1,0,0.99919386982023994,4.2290171895048842E-2,25.372320902629252,-107.27188630209548,72.728113697904519,null,1000000000,76743294.105625018,null,32.871636254556371,-41.592034065162018,null,50.471531832897341,-65.679852236933471,null,0,0]
[8811.0499999999993,8.8110499999999998,4.0449488122291735,1.3209842052531577,1.0239630473388568,0.21676766126476313,1,0,2906.7042383653056,1.5704522945378381,1.6677234472822184,0.92777038328727246,1.0032837211752901,8.0929112130279229E-2,1,0,1,0,0.99918452046548611,4.2535590712989103E-2,25.309218590969394,-107.16391523732432,72.836084762675682,null,1000000000,77634602.102499992,null,32.853212905026389,-41.459857696239538,null,50.426852870767469,-65.704057541084794,null,0,0]
[8861.7749999999996,8.8617749999999997,4.0668160590973956,1.3223558616916062,1.0242364766479868,0.21797653873978207,1,0,2923.438061813134,1.5704542637860839,1.6738788344556246,0.93052280897311068,1.0033215758468415,8.1392969921919023E-2,1,0,1,0,0.99917511743641008,4.2781018986854255E-2,25.246600306754161,-107.0562913372116,72.943708662788396,null,1000000000,78531056.15062499,null,32.835023787460678,-41.328845244236412,null,50.38242370411794,-65.7274460929752,null,0,0]
[8912.5,8.9124999999999996,4.0886908755896512,1.3237128437216215,1.0245114019604518,0.21918476918064236,1,0,2940.1718852721706,1.570456210618598,{"$f":"SQRT(1+(A158/Zero2)^2)","v":1.6800468097012942},{"$f":"ATAN(A158/Zero2)","v":0.93325504520721603},1.0033596463808112,8.1856792612983661E-2,1,0,1,0,0.99916566073828927,4.3026456771245454E-2,25.184459964213399,-106.94901774760206,73.050982252397944,null,1000000000,79432656.25,null,32.817065030051673,-41.198986267167953,null,50.338242118986187,-65.750031480434103,null,0,0]
[8964.4,8.9643999999999995,4.1110801116027327,1.3250863099711845,1.0247942428051782,0.22042031439240478,1,0,2957.2933330415613,1.5704581797440498,1.6863705454380158,0.93602986366969154,1.0033988221803061,8.2331322815069857E-2,1,0,1,0,0.99915592944137455,4.3277589806474163E-2,25.121368631525137,-106.83962491745793,73.160375082542075,null,1000000000,80360467.359999999,null,32.798924740590827,-41.067302280611415,null,50.293291075758773,-65.772322636846525,null,0,0]
[9016.2999999999993,9.0162999999999993,4.1334770187752321,1.326444894731414,1.0250786472073641,0.2216551758932081,1,0,2974.4147808222865,1.5704601261999809,1.6927071685086843,0.93878392822554446,1.0034382239063846,8.2805815857507334E-2,1,0,1,0,0.99914614197150065,4.3528732913591224E-2,25.05876507489063,-106.7306048749106,73.269395125089403,null,1000000000,81293665.689999983,null,32.781017646205044,-40.936803977355197,null,50.248594613510051,-65.7938008975554,null,0,0]
[9068.2000000000007,9.0682000000000009,4.1558814730827436,1.3277888336254935,1.0253646138659624,0.22288935048750783,1,0,2991.5362286141526,1.5704620503756246,1.699056534723558,0.94151742953345352,1.0034778515324336,8.3280271531027836E-2,1,0,1,0,0.99913629833441964,4.3779886151089971E-2,24.996643101160888,-106.62196039299027,73.378039607009725,null,1000000000,82232251.24000001,null,32.763339838995108,-40.807480443772938,null,50.204150446990241,-65.814479949217358,null,0,0]
[9120.1,9.1201000000000008,4.1782933531196393,1.3291183574353733,1.0256521414742337,0.22412283499168381,1,0,3008.6576764169681,1.570463952651354,1.7054185017523771,0.9442305566448892,1.0035177050316917,8.3754689626463263E-2,1,0,1,0,0.999126398535917,4.403104957746682E-2,24.93499662251336,-106.5136940582463,73.486305941753699,null,1000000000,83176224.010000005,null,32.745887488113823,-40.67932085782256,null,50.159956319223994,-65.834373200423713,null,0,0]
[9173.2000000000007,9.1732000000000014,4.2012309882272483,1.3304639385352304,1.0259479312548143,0.22538412185270762,1,0,3026.1749958564214,1.5704658766327055,1.711940460974702,0.94698552423715221,1.0035587137384125,8.4240037816960586E-2,1,0,1,0,0.99911621172217968,4.4288030856680149E-2,24.872410664189204,-106.40331832814448,73.596681671855521,null,1000000000,84147598.24000001,null,32.728261034251972,-40.549391480863214,null,50.114996814761682,-65.853926847281272,null,0,0]
[9226.2999999999993,9.2262999999999984,4.2241761474173121,1.3317949039904464,1.0262453522167128,0.22664467963923654,1,0,3043.692315306947,1.5704677784679315,1.7184753148800909,0.94971955979350842,1.0035999588269482,8.4725346228925136E-2,1,0,1,0,0.99910596613229663,4.4545022925271918E-2,24.81030987929951,-106.29334334366023,73.706656656339774,null,1000000000,85124611.689999983,null,32.710862709671304,-40.42065787319774,null,50.070294354452656,-65.872685470462471,null,0,0]
[9279.4,9.279399999999999,4.2471287087430216,1.3331114860068363,1.026544402942122,0.22790450498065587,1,0,3061.2096347683564,1.5704696585372158,1.7250229169228979,0.95243286055991727,1.0036414402681564,8.5210614638671467E-2,1,0,1,0,0.99909566177257292,4.4802025845900963E-2,24.748688076459491,-106.18377131352443,73.816228686475569,null,1000000000,86107264.359999999,null,32.693688650781404,-40.293108742431833,null,50.025846610502555,-65.890662571092605,null,0,0]
[9332.5,9.3324999999999996,4.2700885528405941,1.3344139119979057,1.0268450820071211,0.22916359451956655,1,0,3078.7269542404629,1.5704715172120896,1.7315831224902658,0.9551256220231521,1.0036831580327317,8.5695842822626295E-2,1,0,1,0,0.99908529864935058,4.5059039681229575E-2,24.687539170571263,-106.0746042714366,73.925395728563402,null,1000000000,87095556.25,null,32.676735070981195,-40.166732896475757,null,49.981651284414532,-65.907871374960834,null,0,0]
[9386.85,9.3868500000000008,4.2935963029196156,1.3357325703774838,1.0271545240006181,0.23045155816436599,1,0,3096.6566400010497,1.5704733978642353,1.7383106616326964,0.95786070434547754,1.003726102556755,8.6192451625052124E-2,1,0,1,0,0.99907463072502778,4.5322115116621715E-2,24.625434274005951,-105.96328873039566,74.036711269604339,null,1000000000,88112952.922499999,null,32.65960684791137,-40.038585564517973,null,49.936674610919042,-65.924703165877688,null,0,0]
[9441.2000000000007,9.4412000000000003,4.3171114376455826,1.3370368656447518,1.0274656688617838,0.23173874388171437,1,0,3114.5863257724627,1.5704752568637452,1.7450511041919943,0.96057467775622218,1.0037692945987968,8.6689017811928101E-2,1,0,1,0,0.99906390125156119,4.5585202119487786E-2,24.563812232656023,-105.85240124761425,74.147598752385747,null,1000000000,89136257.440000013,null,32.642701818662772,-39.911644001809464,null,49.891957598817712,-65.940757245804761,null,0,0]
[9495.5499999999993,9.4955499999999997,4.3406338370007935,1.3383270268316947,1.0277785150440635,0.23302514811473479,1,0,3132.5160115545159,1.5704770945824207,1.7518043012221782,0.96326774616752597,1.0038127341269065,8.7185541143886477E-2,1,0,1,0,0.99905311023587051,4.5848300757031939E-2,24.502666853342379,-105.74194347758582,74.258056522414179,null,1000000000,90165469.80249998,null,32.626016162081342,-39.785896532633089,null,49.847497876085498,-65.956046944952746,null,0,0]
[9549.9,9.5498999999999992,4.3641633835184006,1.3396032782214695,1.028093060994334,0.23431076732121392,1,0,3150.4456973470278,1.5704789113835997,1.7585701057854877,0.96594011157527659,1.0038564211089558,8.7682021381685418E-2,1,0,1,0,0.99904225768491606,4.6111411096462253E-2,24.441992050205563,-105.63191691119177,74.368083088808234,null,1000000000,91200590.00999999,null,32.609546133991763,-39.661331590587189,null,49.803293101038264,-65.970585320604556,null,0,0]
[9605.5249999999996,9.6055250000000001,4.3882521917694062,1.3408952953751812,1.0284167443179519,0.23562572940028653,1,0,3168.7959967543329,1.5704807495164532,1.7655075331588155,0.9686539397472318,1.0039013891424819,8.819010370801382E-2,1,0,1,0,0.99903108683307007,4.6380705944581581E-2,24.380374897038365,-105.51975711154276,74.480242888457241,null,1000000000,92266110.52562499,null,32.592909181638305,-39.535056980064653,null,49.758312900224524,-65.984700131478107,null,0,0]
[9661.15,9.6611499999999992,4.4123482453751413,1.3421732031026457,1.0287422047821329,0.23693986172827824,1,0,3187.1462961722204,1.5704825664828554,1.7724578614125479,0.97134650418438861,1.0039466163075381,8.869814038790097E-2,1,0,1,0,0.99901985153985817,4.6650013192518353E-2,24.31923809331019,-105.40805164717506,74.591948352824943,null,1000000000,93337819.32249999,null,32.576490396862461,-39.409996863707391,null,49.713594881272194,-65.99805478346768,null,0,0]
[9716.7749999999996,9.7167750000000002,4.4364514262787837,1.3434372271646977,1.0290694407007255,0.23825316055575357,1,0,3205.4965956005099,1.5704843626463174,1.7794209393761311,0.9740180152375898,1.0039921025691048,8.9206131165283573E-2,1,0,1,0,0.99900855181287296,4.6919332912335319E-2,24.258575449538561,-105.29680162612817,74.703198373871828,null,1000000000,94415716.40062499,null,32.560286004743574,-39.286139195456165,null,49.669136629619445,-66.010662430671999,null,0,0]
[9772.4,9.7723999999999993,4.4605616189406998,1.3446875886206839,1.02939845038053,0.23956562214953225,1,0,3223.8468950390238,1.5704861383620727,1.7863966179608033,0.97666868118317818,1.0040378478919683,8.9714075784239414E-2,1,0,1,0,0.99899718765975187,4.7188665176099653E-2,24.198380884455609,-105.18600800452897,74.813991995471028,null,1000000000,95499801.75999999,null,32.544292307227963,-39.163472047645676,null,49.624935762052104,-66.022535956883274,null,0,0]
[9829.2999999999993,9.8292999999999999,4.4852315865193892,1.3459526997653803,1.0297368348458771,0.24090729701829081,1,0,3242.6178080930413,1.5704879339854341,1.7935450723889523,0.97935875165816255,1.0040849097587967,9.0233615154495433E-2,1,0,1,0,0.99898549637476597,4.7464183952161225E-2,24.137284644970343,-105.07314789922974,74.926852100770262,null,1000000000,96615138.48999998,null,32.528146229958978,-39.039212657541078,null,49.579985599835823,-66.033935241688667,null,0,0]
[9886.2000000000007,9.8862000000000005,4.5099086541956455,1.3472039681647336,1.0300770717119105,0.24224808798257608,1,0,3261.3887211573942,1.5704897089393857,1.8007064026662754,0.98202744473312575,1.0041322426239385,9.0753105684786034E-2,1,0,1,0,0.99897373769263509,4.7739716006369295E-2,24.076665652683108,-104.96076692002799,75.039233079972007,null,1000000000,97736950.440000013,null,32.512213027613463,-38.916174119642235,null,49.535299809894099,-66.044592800385757,null,0,0]
[9943.1,9.9431000000000012,4.5345927060541493,1.3484416159271866,1.0304191591436833,0.24358799109962678,1,0,3280.159634231904,1.5704914635787732,1.8078804557823154,0.98467497665884929,1.0041798464490728,9.1272547101647228E-2,1,0,1,0,0.99896191162167736,4.8015261415875567E-2,24.01651773530461,-104.8488656375298,75.151134362470202,null,1000000000,98865237.610000014,null,32.49648898005718,-38.79434404835483,null,49.490875940071888,-66.054521589174939,null,0,0]
[10000,10,4.559283628657397,1.3496658605188045,1.0307630952987097,0.2449270024446534,1,0,3298.9305473163977,1.5704931982503663,1.8150670808760085,0.98730156145693315,1.0042277211956656,9.1791939131772721E-2,1,0,1,0,0.99895001817025952,4.8290820257836771E-2,23.956834829323945,-104.73744448259224,75.262555517407762,null,1000000000,100000000,null,32.480970443674607,-38.673710185353613,null,49.446711570473809,-66.063734297238625,null,0,0]
[10058.25,10.058249999999999,4.5845673653090575,1.3509054896873505,1.0311171047319374,0.24629685511276445,1,0,3318.146815993905,1.5704949537482558,1.8224370823019946,0.98996898679001388,1.0042770124096019,9.2323602727969731E-2,1,0,1,0,0.99893777274815299,4.857293095820097E-2,23.896211369154365,-104.62387742708135,75.376122572918646,null,1000000000,101168393.0625,null,32.465292874260584,-38.551440634264935,null,49.401765679718238,-66.072436792816418,null,0,0]
[10116.5,10.1165,4.6098580696898637,1.352131518961295,1.031473047722377,0.24766576492460637,1,0,3337.3630846815199,1.5704966890301135,1.8298199461477356,0.99261490604056923,1.004326587470773,9.2855213987003749E-2,1,0,1,0,0.9989254567282424,4.8855055899631003E-2,23.836062727003181,-104.51081404341716,75.489185956582844,null,1000000000,102343572.25,null,32.44982319377344,-38.430399133948391,null,49.357086718054205,-66.080414909468772,null,0,0]
[10174.75,10.17475,4.6351556277461885,1.3533441672991471,1.0318309222690141,0.24903372772815557,1,0,3356.5793533790697,1.5704984044431469,1.8372155173500577,0.99523954164989115,1.0043764463371478,9.3386772616169178E-2,1,0,1,0,0.99891307011966224,4.913719516492298E-2,23.776382736782999,-104.39825437781089,75.601745622189114,null,1000000000,103525537.5625,null,32.434557730594733,-38.310572942579455,null,49.312672191012723,-66.087681435231445,null,0,0]
[10233,10.233000000000001,4.6604599278702148,1.3545436490633658,1.0321907263627583,0.2504007393913083,1,0,3375.7956220863844,1.5705001003266583,1.8446236430677732,0.99784311366806833,1.0044265889664628,9.3918278322937337E-2,1,0,1,0,0.99890061293160026,4.9419348836878575E-2,23.717165341986185,-104.28619834856164,75.713801651438359,null,1000000000,104714289,null,32.419492889440555,-38.191949454896672,null,49.26851963737009,-66.094248893664954,null,0,0]
[10292.5,10.2925,4.6863140858048613,1.3557554955716253,1.0325602415782147,0.25179609981748002,1,0,3395.4242570848801,1.570501812784646,1.852203546324044,1.0004810362025955,1.0044781005359542,9.4461134789487644E-2,1,0,1,0,0.99888781556391104,4.9707572268479425E-2,23.657148594491716,-104.1722574347598,75.8277425652402,null,1000000000,105935556.25,null,32.404308233937485,-38.072009127878765,null,49.223687545378695,-66.100248306881042,null,0,0]
[10352,10.352,4.7121750504024789,1.3569540423148783,1.032931765779501,0.25319045919229394,1,0,3415.0528920932188,1.5705035055573087,1.8597962332763289,1.0030974379873721,1.0045299080878449,9.5003935421504579E-2,1,0,1,0,0.99887494457462456,4.9995810906348657E-2,23.597602074812727,-104.05884144899159,75.941158551008414,null,1000000000,107163904,null,32.389325556017511,-37.953297522025785,null,49.179123703619673,-66.105543926965808,null,0,0]
[10411.5,10.4115,4.7380427102076368,1.3581395036540294,1.0333052967996281,0.25458381317653395,1,0,3434.6815271112318,1.5705051789821418,1.8674015479925554,1.005692545922219,1.0045820115763422,9.554667990779793E-2,1,0,1,0,0.99886199997370562,5.0284064838751884E-2,23.538519667136306,-103.94594992801314,76.054050071986865,null,1000000000,108399332.25,null,32.374541258961116,-37.83580163844276,null,49.134825592999654,-66.110148289570418,null,0,0]
[10471,10.471,4.7639169561571304,1.3593120894418818,1.033680832463044,0.25597615745285468,1,0,3454.3101621387532,1.5705068333889691,1.8750193368133241,1.0082665843760135,1.0046344109554017,9.6089367937374187E-2,1,0,1,0,0.99884898177117643,5.0572334153960848E-2,23.479895364961834,-103.83358229361693,76.166417706383072,null,1000000000,109641841,null,32.359951821455283,-37.719508622818864,null,49.090790728331015,-66.114073670798078,null,0,0]
[10532,10.532,4.7904502195942111,1.3605010847419721,1.0340679142117897,0.25740255013781815,1,0,3474.4336367144865,1.5705085100977407,1.882841962005773,1.0108838738703707,1.0046884384524706,9.6645678242847255E-2,1,0,1,0,0.99883555898096799,5.0867886824641717E-2,23.420262538298502,-103.71892500506783,76.281074994932169,null,1000000000,110923024,null,32.345193264320486,-37.601519281832772,null,49.045916458802481,-66.117405723235066,null,0,0]
[10593,10.593,4.8169901807249449,1.3616769797779036,1.0344570982940589,0.25882787244426636,1,0,3494.5571112998759,1.5705101674957929,1.890677378270019,1.0134794876836752,1.0047427768481836,9.7201928547820157E-2,1,0,1,0,0.99882205885288811,5.1163455851424573E-2,23.361098762797692,-103.60481677282375,76.395183227176247,null,1000000000,112211649,null,32.330632255251061,-37.484767321692317,null,49.001313692371092,-66.120049451131464,null,0,0]
[10654,10.654,4.843536729450121,1.3628399866713057,1.0348483823379251,0.26025211979190793,1,0,3514.6805858947541,1.5705118059148186,1.8985254272357288,1.0160536594300482,1.0047974260921013,9.775811851783156E-2,1,0,1,0,0.99880848139792655,5.1459041329447376E-2,23.30239790854877,-103.4912566331795,76.508743366820497,null,1000000000,113507716,null,32.31626523489696,-37.369239357135733,null,48.956979858476267,-66.122017276043763,null,0,0]
[10715,10.715,4.8700897580440659,1.3639903130588207,1.0352417639622591,0.26167528762480191,1,0,3534.8040604989601,1.5705134256789581,1.906385952887188,1.0186066200165775,1.004852386133507,9.8314247818641926E-2,1,0,1,0,0.99879482662713781,5.1754643353855032E-2,23.244153956190704,-103.37824351874559,76.621756481254408,null,1000000000,114811225,null,32.302088719419999,-37.254922157582726,null,48.912912421595173,-66.123321361162866,null,0,0]
[10777.5,10.7775,4.8973023405867142,1.3651559866247902,1.0356469919901081,0.2631323269902891,1,0,3555.4223746521225,1.5705150662559761,1.9144525501097647,1.0212005970044813,1.0049090199533106,9.8883989155509999E-2,1,0,1,0,0.99878075590390791,5.2057531541706545E-2,23.184945487830593,-103.2630175414302,76.736982458569798,null,1000000000,116154506.25,null,32.287757624887689,-37.139035996045145,null,48.868035047767357,-66.12398154538505,null,0,0]
[10840,10.84,4.9245215040095029,1.3663087757560721,1.0360544169363262,0.26458822349282313,1,0,3576.0406888147436,1.5705166879149026,1.9225319209912133,1.0237727889900088,1.0049659799349717,9.9453666093092322E-2,1,0,1,0,0.99876660403938333,5.2360437301946887E-2,23.12620422015458,-103.14836324339271,76.851636756607292,null,1000000000,117505600,null,32.273619350163187,-37.024393249467742,null,48.823432054815854,-66.123969993924959,null,0,0]
[10902.5,10.9025,4.9517471397894939,1.3674488898863193,1.0364640362101456,0.26604297231186758,1,0,3596.6590029866611,1.5705182909810891,1.9306239051640126,1.0263234356500379,1.0050232660230345,0.10002327827261347,1,0,1,0,0.99875237104566372,5.2663360736936927E-2,23.067924024109274,-103.0342791719702,76.965720828029802,null,1000000000,118864506.25,null,32.259670382773677,-36.910980183461916,null,48.779100826160054,-66.123298988508239,null,0,0]
[10965,10.965,4.9789791417518883,1.368576534000729,1.0368758472109492,0.26749656865391386,1,0,3617.2773171677168,1.5705198757724683,1.9387283446897645,1.028852773784511,1.0050808781617375,0.10059282533554759,1,0,1,0,0.99873805693492013,5.296630194904537E-2,23.010098882052404,-102.92076378249922,77.079236217500778,null,1000000000,120231225,null,32.245907285591365,-36.798783228064558,null,48.735038781285496,-66.121980554434657,null,0,0]
[11028.75,11.02875,5.0067622344661258,1.3697140924553135,1.0372981496417053,0.26897804469801989,1,0,3638.3079976416448,1.5705214737551763,1.9470075432073628,1.0314109892466579,1.0051399783824395,0.10117369588507837,1,0,1,0,0.99872337298789882,5.3275320405554938E-2,22.951579906600369,-102.80556224886763,77.194437751132369,null,1000000000,121633326.5625,null,32.232056922003423,-36.685581267465537,null,48.690370169421406,-66.119980981402122,null,0,0]
[11092.5,11.092499999999999,5.0345517346143627,1.3708390942607651,1.0377227268487683,0.27045831171703671,1,0,3659.3386781247573,1.5705230533702681,1.9552993758955812,1.0339475239574667,1.0051994177080736,0.10175449793463001,1,0,1,0,0.99870860467252864,5.3584357572542582E-2,22.893522066065497,-102.69094885470477,77.309051145295228,null,1000000000,123043556.25,null,32.218392945790605,-36.573616545269694,null,48.645976305099353,-66.117332309435071,null,0,0]
[11156.25,11.15625,5.0623475366767465,1.3719517433798714,1.0381495760411588,0.27193736471124758,1,0,3680.3693586168956,1.5705246149326175,1.9636036827011074,1.0364626201400202,1.0052591960784876,0.10233523110454318,1,0,1,0,0.99869375200195287,5.389341355866837E-2,22.835919316954719,-102.57692169683357,77.423078303166434,null,1000000000,124461914.0625,null,32.204911939898501,-36.462875179404705,null,48.601854561880671,-66.114046517428847,null,0,0]
[11220,11.22,5.0901495374146064,1.3730522394431655,1.0385786944175621,0.27341519871037945,1,0,3701.400039117907,1.5705261587499415,1.9719203060279782,1.0389565170252024,1.0053193134332006,0.10291589501543444,1,0,1,0,0.99867881498939182,5.4202488472601063E-2,22.778765725965297,-102.46347879321684,77.536521206783164,null,1000000000,125888400,null,32.191610561043831,-36.353343458844428,null,48.558002349745934,-66.110135334372416,null,0,0]
[11285.5,11.285500000000001,5.1187210804172736,1.3741704925111085,1.0390219530348175,0.27493232586039296,1,0,3723.008032426068,1.570527726780254,1.9804778940412591,1.0414970419460967,1.0053814340745186,0.10351242618452848,1,0,1,0,0.99866338010849975,5.4520067624483852E-2,22.720504912567215,-102.34752814082988,77.65247185917012,null,1000000000,127362510.25,null,32.178127699476434,-36.242050662858347,null,48.513224397915245,-66.105477477971533,null,0,0]
[11351,11.351000000000001,5.1472989532643112,1.3752763298370512,1.0394676010998989,0.27644815562942648,1,0,3744.6160257432775,1.5705292767141912,1.9890481545495731,1.0440156901626378,1.00544391243597,0.1041088834288648,1,0,1,0,0.99864785622006946,5.4837666990221523E-2,22.662705903293325,-102.23218978185713,77.76781021814287,null,1000000000,128845201,null,32.164827538020603,-36.132006037280249,null,48.468725550097183,-66.10018374457691,null,0,0]
[11416.5,11.416499999999999,5.1758830511078244,1.3763699543935919,1.0399156355408663,0.27796268272395769,1,0,3766.2240190693792,1.5705308088632264,1.9976309244498494,1.0465127114915003,1.0055067484508724,0.10470526633787065,1,0,1,0,0.99863224333869327,5.5155286687708971E-2,22.605362610007749,-102.11746133670421,77.88253866329579,null,1000000000,130336472.25,null,32.15170668179023,-36.023195262991024,null,48.424503113041979,-66.0942660737132,null,0,0]
[11482,11.481999999999999,5.2044732713807127,1.377451564811611,1.0403660532746357,0.279475901883463,1,0,3787.8320124042211,1.5705323235317261,2.0062260431940344,1.0489883525564174,1.0055699420521789,0.10530157450128705,1,0,1,0,0.99861654147904921,5.5472926834850993E-2,22.54846905667355,-102.00334035767719,77.996659642322811,null,1000000000,131836324,null,32.138761810182757,-35.915604203424408,null,48.380554431315247,-66.087736154252781,null,0,0]
[11548.75,11.54875,5.2336153014647575,1.3785416576626015,1.0408275155139382,0.28101664824499145,1,0,3809.8523720329181,1.5705338494299406,2.0149977318995815,1.0514894945506748,1.0056347094562188,0.10590918526818734,1,0,1,0,0.99860044843932227,5.5796649977714864E-2,22.490946371248235,-101.8876638630091,78.112336136990905,null,1000000000,133373626.5625,null,32.125747590767965,-35.807200283124402,null,48.336045965304734,-66.080463579884707,null,0,0]
[11615.5,11.615500000000001,5.2627634817867737,1.3796196766731812,1.0412914463796301,0.28255602534799845,1,0,3831.872731670383,1.5705353577906065,2.0237819165334403,1.0539689396308176,1.0056998480834858,0.10651671755012695,1,0,1,0,0.9985842630238535,5.6120394605466493E-2,22.433878568648915,-101.77261291189413,78.227387088105871,null,1000000000,134919840.25,null,32.1129094016134,-35.700034002748524,null,48.291816351859971,-66.072578909145605,null,0,0]
[11682.25,11.68225,{"$f":"SQRT(1+(A205/pole1)^2)","v":5.2919177107191917},{"$f":"ATAN(A205/pole1)","v":1.3806858188684132},{"$f":"SQRT(1+(A205/Zero1)^2)","v":1.0417578425736171},{"$f":"ATAN(A205/Zero1)","v":0.28409402773104159},{"$f":"IF(VIN_nom>Vout, 1, SQRT(1+(A205/z_RHP)^2))","v":1},{"$f":"IF(VIN_nom>Vout, 0, -ATAN(A205/z_RHP))","v":0},{"$f":"SQRT(1+(A205/Pole2)^2)","v":3853.8930913164668},{"$f":"ATAN(A205/Pole2)","v":1.5705368489143414},2.0325784350848335,1.0564269388098151,{"$f":"SQRT(1+(A205/pole4)^2)","v":1.0057653578618531},{"$f":"ATAN(A205/pole4)","v":0.10712417091392415},{"$f":"IF(VOUT_setting=1,1,SQRT(1+(A205*zterm1)^2))","v":1},{"$f":"IF(VOUT_setting=1,0,ATAN(((A205*zterm1))))","v":0},1,{"$f":"IF(VOUT_setting=1,0,ATAN(A205*$Q$4/(1+Afbr-$Q$5*(A205)^2)))","v":0},{"$f":"SQRT((1-(Z205/pterm2))^2+(A205/pterm1)^2)","v":0.99856798524845181},{"$f":"IF((ATAN((A205/pterm1)/(1-A205^2/pterm2))>0),ATAN((A205/pterm1)/(1-A205^2/pterm2)),PI()+ATAN((A205/pterm1)/(1-A205^2/pterm2)))","v":5.6444160842922739E-2},{"$f":"20*LOG10(((E205*K205*G205*O205)/(C205*I205*S205*M205*Q205))*Adc)","v":22.377259667329934},{"$f":"((F205+L205+H205+P205)-(D205+J205+T205+N205+R205))*radconv","v":-101.65818472352682},{"$f":"IF(V205>0,V205,V205+180)","v":78.341815276473184},null,{"$f":"IF(U205<0,A205,1000000000)","v":1000000000},{"$f":"A205^2","v":136474965.0625},null,{"$f":"20*LOG10((K205/(I205*M205))*AEA)","v":32.100243954608501},{"$f":"(L205-(J205+N205))*radconv","v":-35.59409097271763},null,{"$f":"20*LOG10((E205*G205/(C205*S205))*Acs*Am)","v":48.247862897545886},{"$f":"(F205+H205-(D205+T205))*radconv","v":-66.06409375080915},null,{"$f":"SUM((U206<0)*(U205>0))*A205","v":0},0]
[11749,{"$f":"A206/1000","v":11.749000000000001},5.3210778888408568,1.3817402770638205,1.0422267007861981,0.28563064996844312,1,0,3875.9134509710216,1.5705383230949317,2.0413871281099278,1.0588637398137919,1.0058312387188015,0.10773154492674263,1,0,1,0,0.99855161512901836,5.6767948814911352E-2,22.321083796022823,-101.54437646181492,78.45562353818508,null,1000000000,138039001,null,32.087748033961077,-35.489356991403334,null,48.204182946886213,-66.055019470411594,null,0,0]
[11817.5,11.817500000000001,5.3510086492031883,1.3828104306218816,1.0427104073641218,0.28720611763434456,1,0,3898.5111234341657,1.5705398186102835,2.0504392535255529,1.0613426442663638,1.0058992325118472,0.10835475965045228,1,0,{"$f":"IF(VOUT_setting=1,1,SQRT((1+Afbr-$Q$5*(A207)^2)^2+(A207*$Q$4)^2))","v":1},0,0.99853471983992304,5.7100248337791745E-2,22.26388971008635,-101.42822595333806,78.571774046661943,null,1000000000,139653306.25,null,32.075097458112687,-35.383119488450212,null,48.159639436798116,-66.045106464887851,null,0,0]
[11886,11.885999999999999,5.3809454695160754,1.3838686778097915,1.0431966996480035,0.28878012037699052,1,0,3921.1087959059291,1.5705412968880794,2.0595038680179982,1.0637997426137369,1.0059676169398248,0.10897788988543199,1,0,1,0,0.99851772733554445,5.7432571016181808E-2,22.207150006023461,-101.31272209004445,78.687277909955554,null,1000000000,141276996,null,32.062618778072121,-35.278125554807168,null,48.115378412775797,-66.03459653523727,null,0,0]
[11954.5,11.954499999999999,5.4108882491958585,1.3849152138998833,1.0436855740235114,0.29035265245040387,1,0,3943.7064683861627,1.5705427582246361,2.0685808074041745,1.0662352920467897,1.0060363919230748,0.10960093516504835,1,0,1,0,0.99850063763337127,5.7764916985023181E-2,22.150858684425572,-101.19786165145617,78.802138348543835,null,1000000000,142910070.25,null,32.050308744049751,-35.17436044476392,null,48.071397125200278,-66.023501206692231,null,0,0]
[12023,12.023,5.4408368898532586,1.3859502299689479,1.0441770268639077,0.29192370814843382,1,0,3966.3041408747222,1.5705442029095171,2.0776699101488321,1.0686495462876962,1.006105557381505,0.11022389502305904,1,0,1,0,0.99848345075099443,5.8097286379269891E-2,22.095009857352789,-101.08364137280479,78.916358627195208,null,1000000000,144552529,null,32.038164178583266,-35.071809610987721,null,48.027692863593984,-66.011831761817078,null,0,0]
[12093,12.093,5.4714472949042641,1.3869962040116877,1.0446819014355953,0.29352763540627796,1,0,3989.3966529152808,1.5705456623216758,2.0869704447635216,1.0710949280822375,1.006176640722845,0.11086040760513603,1,0,1,0,0.99846578713638856,5.8436958276353687E-2,22.038389185157659,-100.96757782099495,79.032422179005053,null,1000000000,146240649,null,32.025921384229243,-34.968252657461292,null,47.98331498575287,-65.999325163533669,null,0,0]
[12163,12.163,5.5020636194457548,1.3880305384956595,1.0451894609373831,0.29513000900130931,1,0,4012.4891649642391,1.5705471049355373,2.0962833484547931,1.0735185966609937,1.0062481316572167,0.11149683000037962,1,0,1,0,0.99844802207638261,5.8776654920990004E-2,21.982218512206831,-100.85217575367302,79.147824246326977,null,1000000000,147938569,null,32.013844898751223,-34.865933649763967,null,47.939220798280068,-65.986242103909049,null,0,0]
[12233,12.233000000000001,5.532685765207356,1.3890534244559878,1.0456997014596543,0.29673082297336761,1,0,4035.5816770214519,1.5705485310394725,2.1056084571009444,1.0759208118437023,1.0063200300977515,0.1121331617125214,1,0,1,0,0.99843015559008086,5.9116376457234575E-2,21.926491899537488,-100.73743156760514,79.262568432394858,null,1000000000,149646289,null,32.001931553553426,-34.764837689409696,null,47.895407530808512,-65.972593878195454,null,0,0]
[12303,12.303000000000001,5.563313636063846,1.3900650488179851,1.0462126190797874,0.29833007140586237,1,0,4058.6741890867788,1.5705499409152892,2.1149456092616168,1.0783018298612668,1.0063923359571101,0.11276940224572811,1,0,1,0,0.99841218769669993,5.9456123029156968E-2,21.871203518879195,-100.62334162686096,79.376658373139037,null,1000000000,151363809,null,31.99017825108815,-34.664950083186341,null,47.851872452615503,-65.958391543674622,null,0,0]
[12374.5,12.374499999999999,5.5946036311048353,1.3910869148539331,1.0467392874618695,0.29996196712153184,1,0,4082.2615407045964,1.5705513645356122,{"$f":"SQRT(1+(A215/Zero2)^2)","v":2.1244951115405772},{"$f":"ATAN(A215/Zero2)","v":1.0807122490385852},1.0064666117444088,0.11341918185894224,1,0,1,0,0.99839373010725474,5.9803175880717763E-2,21.815176858953205,-100.50747851553439,79.492521484465613,null,1000000000,153128250.25,null,31.978335167524623,-34.564154434240372,null,47.807688876253039,-65.943324081294051,null,0,0]
[12446,12.446,5.6258994031012861,1.3920974130556956,1.0472687405901762,0.30159221714528972,1,0,4105.8488923305931,1.5705527717990577,2.1340568468804286,1.083101082014136,1.0065413124127236,0.11406886529937524,1,0,1,0,0.99837516675903248,6.0150255156295532E-2,21.759595464061178,-100.39229023125569,79.607709768744314,null,1000000000,154902916,null,31.966652745288307,-34.464589136078303,null,47.763789903597328,-65.927701095177383,null,0,0]
[12517.5,12.5175,5.657200856178429,1.3930967300379546,1.0478009742433159,0.30322081531294687,1,0,4129.4362439646266,1.5705541629859177,2.1436306515832602,1.0854685905629178,1.0066164378674642,0.11471845204005139,1,0,1,0,0.99835649767287382,6.0497361009466434E-2,21.704453464425875,-100.27777281550316,79.722227184496845,null,1000000000,156687806.25,null,31.955127901241582,-34.366239175963578,null,47.72017274800875,-65.911533639539584,null,0,0]
[12589,12.589,5.6885078965545111,1.3940850483976641,1.0483359841863236,0.30484775550784932,1,0,4153.0235956065626,1.570555538370116,2.1532163646577454,1.0878150327634704,1.0066919880135297,0.11536794155447824,1,0,1,0,0.99833772286974087,6.0844493593822047E-2,21.649745099922338,-100.16392228828806,79.836077711711937,null,1000000000,158482921,null,31.94375762185129,-34.269089752613937,null,47.676834662895502,-65.894832535674112,null,0,{"$f":"IF(AH218>0,W218,0)","v":0}]
[12662.25,12.66225,5.7205868913598765,1.3950863374415492,1.048886963384783,0.30651279023354761,1,0,4177.1882600589761,1.5705569313098731,2.1630488767021423,1.0901973252755202,1.0067698275994297,0.11603322629062296,1,0,1,0,0.99831837893564168,6.120015031141543E-2,21.594141495273291,-100.04797260140987,79.952027398590133,null,1000000000,160332575.0625,null,31.932266255168948,-34.170792263120312,null,47.632722424928808,-65.877180338289577,null,0,0]
[12735.5,12.7355,5.7526715575417358,1.3960764583887975,1.049440847397104,0.30817607199020997,1,0,4201.3529245194022,1.5705583082262575,2.172893553595888,1.0925580442929701,1.006848112716447,0.1166984078658283,1,0,1,0,0.99829892409121535,6.1555835411125776E-2,21.538981115205893,-99.932714335064787,80.067285664935213,null,1000000000,162192960.25,null,31.920930924891348,-34.073724015059938,null,47.588897375139005,-65.85899032000485,null,0,0]
[12808.75,12.80875,5.7847618007327348,1.3970555951426309,1.0499976316263335,0.30983759435630892,1,0,4225.5175889877037,1.5705596693941699,2.1827502307406639,1.0948974555832571,1.0069268432606664,0.1173634857155833,1,0,1,0,0.99827935835939996,6.1911549058151348E-2,21.484258107691893,-99.818143159576863,80.181856840423137,null,1000000000,164064076.5625,null,31.90974860630055,-33.977869764486897,null,47.545356686215797,-65.840273395089966,null,0,0]
[12882,12.882,5.816857528631707,1.3980239276326811,1.050557311461219,0.311497350962751,1,0,4249.682253463744,1.5705610150822589,2.1926187462990381,1.0972158210708298,1.0070060191276136,0.11802845927592009,1,0,1,0,0.99825968176326829,6.2267291417707725E-2,21.429966730549769,-99.704254734456924,80.295745265543076,null,1000000000,165945924,null,31.898716343619377,-33.883214487315158,null,47.502097571754845,-65.821040247141781,null,0,0]
[12957.25,12.95725,5.8498352069163175,1.399007633428023,1.0511352830726437,0.31320057978288091,1,0,4274.506704008485,1.5705623816689751,2.2027688698620898,1.0995758422744046,1.0070878204097973,0.11871147991936776,1,0,1,0,0.99823935250041962,6.2632776952032565E-2,21.374636543493615,-99.587963125645942,80.412036874354058,null,1000000000,167890327.5625,null,31.887536081286459,-33.78720773252028,null,47.457947647031617,-65.800755393125655,null,0,0]
[13032.5,13.032500000000001,5.8828184824836258,1.3999803094434484,1.0517163006586636,0.31490193164654667,1,0,4299.3311545611159,1.5705637324742763,2.2129311496003843,1.101914200901503,1.0071700914393258,0.11939438929581664,1,0,1,0,0.99821890628638321,6.2998293141751802E-2,21.319749938413402,-99.472382749973576,80.527617250026424,null,1000000000,169846056.25,null,31.876508072706628,-33.692434872594376,null,47.414089050531238,-65.779947877379215,null,0,0]
[13107.75,13.107749999999999,5.9158072617115574,1.4009421383415745,1.0523003591738616,0.31660139982150293,1,0,4324.1556051215039,1.5705650677699603,2.2231054188086703,1.1042311686265953,1.0072528321010936,0.12007718679563918,1,0,1,0,0.99819834314661782,6.3363840166044558E-2,21.265301035067601,-99.3575088840756,80.6424911159244,null,1000000000,171813110.0625,null,31.865629328754871,-33.598880322380666,null,47.370518891137195,-65.758628561694934,null,0,0]
[13183,13.183,5.9488014530392936,1.4018932988138655,1.0528874535576378,0.31829897763392706,1,0,4348.9800556895125,1.5705663878216185,2.2332915136246529,1.1065270130951432,1.0073360422793769,0.12075987180982482,1,0,1,0,0.99817766310673217,6.3729418204109683E-2,21.21128406437176,-99.243336804236108,80.756663195763892,null,1000000000,173791489,null,31.854896929259723,-33.506528727247314,null,47.327234319936494,-65.736808076988794,null,0,0]
[13259.75,13.25975,5.9824588180332148,1.4028526110264301,1.0534893728015189,0.32002844008666914,1,0,4374.2993458114452,1.5705677187528642,2.2436926680551412,1.1088471362589982,1.0074213946601622,0.12145604866095758,1,0,1,0,0.99815645044815116,6.4102315645132371E-2,21.156629407681908,-99.127606882180942,80.872393117819058,null,1000000000,175820970.0625,null,31.844098386051542,-33.413559714009452,null,47.283378206454827,-65.714047168171462,null,0,0]
[13336.5,13.336499999999999,6.0161216269591611,1.4038011885683086,1.0540944394704921,0.32175592222453925,1,0,4399.6186359410358,1.5705690343654026,2.2541057887206462,1.1111458355094392,1.0075072352171601,0.12215210721956056,1,0,1,0,0.99813511623681761,6.4475245725287442E-2,21.102412294690602,-99.012597087029874,80.987402912970126,null,1000000000,177862232.25,null,31.833446154971025,-33.321810545232303,null,47.239813324544031,-65.690786541797593,null,0,0]
[13413.25,13.41325,6.0497897889422214,1.4047392089391211,1.0547026481476696,0.323481417154381,1,0,4424.9379260781543,1.5705703349221929,2.264530710546111,1.1134233822642927,1.0075935638256019,0.1228480468414764,1,0,1,0,0.99811366050038497,6.4848208634768978E-2,21.048626944926106,-98.898302421671175,81.101697578328825,null,1000000000,179915275.5625,null,31.822937347705484,-33.231265647978823,null,47.196536782045087,-65.667036773692359,null,0,0]
[13490,13.49,6.0834632151049304,1.4056668457837298,1.0553139934005549,0.32520491804621976,1,0,4450.2572162226734,1.5705716206802096,2.2749672712968967,1.1156800438470518,1.0076803803600525,0.12354386688322865,1,0,1,0,0.99809208326666954,6.5221204563792906E-2,20.995267687131062,-98.78471789879697,81.21528210120303,null,1000000000,181980100,null,31.812569142883245,-33.141909683596175,null,47.15354572907227,-65.642808215200816,null,0,0]
[13568.5,13.5685,6.1179097942492824,1.4066050696567056,1.0559425171112573,0.32696564719480931,1,0,4476.1538191793134,1.5705729207081724,2.2856536730727295,1.1179668297535299,1.0077696810340313,0.12425542815742127,1,0,1,0,0.99806988838876498,6.5602739641735033E-2,20.941126745099034,-98.669272930347972,81.330727069652028,null,1000000000,184104192.25,null,31.802107104851739,-33.051730446393641,null,47.109866825071755,-65.617542483954324,null,0,0]
[13647,13.647,6.1523616984622782,1.407532786634327,1.0565743105196046,0.32872427608470911,1,0,4502.0504221434321,1.5705742057801464,2.2963519161402397,1.1202323200614743,1.0078594918708255,0.12496686297664931,1,0,1,0,0.9980475664692009,6.5984309664749358E-2,20.887419885144677,-98.554560344971506,81.445439655028494,null,1000000000,186240609,null,31.791786390609179,-32.962763254859873,null,47.066480679359955,-65.591797090111641,null,0,0]
[13725.5,13.7255,6.1868188387844256,1.408450170658903,1.0572093677636358,0.33048079761298582,1,0,4527.9470251148996,1.5705754761527442,2.3070618357691064,1.1224767879303272,1.0079498127340649,0.12567817065464132,1,0,1,0,0.99802511753826795,6.636591483643367E-2,20.834141376977602,-98.440574851960363,81.559425148039637,null,1000000000,188389350.25,null,31.781604187160575,-32.874992433494029,null,47.023384374641488,-65.565582418466363,null,0,0]
[13804,13.804,6.2212811282137022,1.4093573918890359,1.0578476829652195,0.33223520474573431,1,0,4553.8436280935912,1.5705767320767408,2.3177832700955818,1.1247005023207957,1.008040643486654,0.12638935050588571,1,0,1,0,0.99800254162643509,6.6747555360410257E-2,20.781285598776552,-98.327311180142232,81.672688819857768,null,1000000000,190550416,null,31.771557747182527,-32.788402547074185,null,46.980575036418493,-65.538908633068047,null,0,0]
[13884.25,13.88425,6.2565169192045005,1.4102745059801842,1.0585035896970882,0.33402652998762605,1,0,4580.3175438848812,1.5705780013189088,2.32875545427471,1.1269526131039322,1.0081340260515974,0.12711625183898045,1,0,1,0,0.99797933120322957,6.7137740549468139E-2,20.727682734390925,-98.212263193089967,81.787736806910033,null,1000000000,192772398.0625,null,31.761424884974367,-32.701087204832945,null,46.937105034241014,-65.511175988257023,null,0,0]
[13964.5,13.964499999999999,6.291757913596677,1.4111813470646977,1.0591628887909557,0.33581563086541466,1,0,4606.7914596834653,1.5705792559731317,2.3397393390942893,1.1291835900875267,1.0082279412011517,0.12784301813616045,1,0,1,0,0.99795598813941333,6.7527963115031148E-2,20.674510112134946,-98.097958499009806,81.902041500990194,null,1000000000,195007260.25,null,31.751428302923884,-32.614974167296261,null,46.89392899403552,-65.482984331713567,null,0,0]
[14044.75,14.044750000000001,6.3270040244424308,1.4120780853233015,1.0598255739158331,0.33760250008763348,1,0,4633.2653754892181,1.5705804962894707,2.3507347605394524,1.1313937074626992,1.008322388786502,0.12856964866752488,1,0,1,0,0.99793251246811643,6.7918223274725215E-2,20.62176206059965,-97.984391541291643,82.015608458708357,null,1000000000,197255002.5625,null,31.741565267304843,-32.530047696977313,null,46.851043978119264,-65.454343844314366,null,0,0]
[14125,14.125,6.362255166708187,1.4129648872308789,1.0604916387240828,0.33938713043799795,1,0,4659.7392913020167,1.5705817225123047,2.3617415574790357,1.1335832351323372,1.008417368658046,0.12929614270401912,1,0,1,0,0.99790890422266376,6.8308521246203499E-2,20.569433015835166,-97.871556792110781,82.128443207889219,null,1000000000,199515625,null,31.731833108633758,-32.446292301809905,null,46.808447092025872,-65.425264490300862,null,0,0]
[14207.25,14.20725,6.3983899761759995,1.4138636496199839,1.0611778036957045,0.34121390682250846,1,0,4686.8729931858743,1.5705829649203502,2.3730343057739733,1.1358062426264479,1.0085152678218801,0.1300406001090966,1,0,1,0,0.99788457007342612,6.8708585734744365E-2,20.516228909879509,-97.756664018277291,82.243335981722709,null,1000000000,201845952.5625,null,31.721991486808978,-32.361648806550328,null,46.765084607894991,-65.395015211726943,null,0,0]
[14289.5,14.2895,6.434529896043756,1.4147523168153986,1.0618675053529329,0.34303831624179637,1,0,4714.0066950768824,1.5705841930258579,2.3843386699238134,1.1380081819591779,1.0086137258131624,0.13078491258300623,1,0,1,0,0.9978600967311454,6.9108690406314885E-2,20.463453455939955,-97.642528745198248,82.357471254801752,null,1000000000,204189810.25,null,31.71228186784824,-32.278203304602059,null,46.722018772916172,-65.364325440596218,null,0,0]
[14371.75,14.37175,6.470674840683861,1.4156310565757277,1.0625607368088452,0.34486035117188635,1,0,4741.1403969749199,1.5705854070743897,2.3956544854935116,1.1401893301706911,1.0087127424682549,0.13152907934360872,1,0,1,0,0.99783548423233837,6.9508835495340107E-2,20.4111009982418,-97.529145125281545,82.470854874718455,null,1000000000,206547198.0625,null,31.702701576433189,-32.195939891989276,null,46.679246606633065,-65.333205233292304,null,0,0]
[14454,14.454000000000001,6.5068247263595644,1.4165000329936255,1.0632574911592791,0.34668000417143774,1,0,4768.274098879866,1.5705866073059174,2.4069815909752061,1.1423499598854461,1.0088123176226569,0.13227309960971637,1,0,1,0,0.99781073261373676,6.9909021236275862E-2,20.359165988505055,-97.416507348894271,82.583492651105729,null,1000000000,208918116,null,31.693248000678366,-32.114842917471734,null,46.636765172651153,-65.301664431422523,null,0,0]
[14622.5,14.6225,6.5808976333812206,1.4182504301443102,1.0646958565490698,0.3504003348074845,1,0,4823.8610748399542,1.5705890239742624,2.4302212544679369,1.1467133470563473,1.0090180538553439,0.13379686274366404,1,0,1,0,0.99775959136818715,7.0728982573197624E-2,20.254051018284489,-97.18805879014532,82.81194120985468,null,1000000000,213817506.25,null,31.674266122753522,-31.952282909461299,null,46.550632080355427,-65.235775880684017,null,0,0]
[14706.75,14.70675,6.6179415211207049,1.419110933596496,1.0654205541473962,0.35225672032115557,1,0,4851.654562830382,1.5705902115420214,2.4418581894289115,1.1488638747587225,1.0091218002497226,0.13455851043180847,1,0,1,0,0.99773380195202277,7.113902822025811E-2,20.202127723775032,-97.074983915539477,82.925016084460523,null,1000000000,216288495.5625,null,31.66496397551073,-31.872773988925431,null,46.508010933088769,-65.202209926614046,null,0,0]
[14791,14.791,6.6549902546659512,1.419961856723327,1.0661489183642432,0.35411057575113009,1,0,4879.4480508275738,1.5705913855809348,2.4535063102653445,1.1509939927994497,1.0092261319223703,0.13532000108655448,1,0,1,0,0.99770786672740985,7.1549117522525255E-2,20.150619824866034,-96.962667208079026,83.037332791920974,null,1000000000,218773681,null,31.655784270052543,-31.794424683367883,null,46.465682739637948,-65.168242524711147,null,0,0]
[14877.25,14.87725,6.6929234190718088,1.4208232204762026,1.0668983634992009,0.3560058108502242,1,0,4907.9013248968686,1.570592573715786,2.465442366157828,1.1531538172738023,1.0093335464057303,0.13609940513038171,1,0,1,0,0.99768116483073321,7.1968987367673543E-2,20.098313835295944,-96.84846332381224,83.15153667618776,null,1000000000,221332567.5625,null,31.646510887408393,-31.715400493767309,null,46.422650132712008,-65.133062830044921,null,0,0]
[14963.5,14.9635,6.7308614933018616,1.4216748748106329,1.0676516354554344,0.35789837840731931,1,0,4936.3545989730119,1.5705937481537577,2.4773898120951161,1.1552928197319392,1.0094415738989038,0.13687864282839354,1,0,1,0,0.99765431020727058,7.2388903500115773E-2,20.04643181895706,-96.735041319776244,83.264958680223756,null,1000000000,223906332.25,null,31.63736061566506,-31.637559002131656,null,46.379918388116465,-65.097482317644605,null,0,0]
[15049.75,15.04975,6.7688043947997576,1.4225169817606991,1.068408726138746,0.35978827052133089,1,0,4964.8078730558855,1.5705949091303404,2.4893484840801539,1.1574112805414503,1.0095502142051045,0.13765771328781837,1,0,1,0,0.99762730290116053,7.2808866190463645E-2,19.994968183688741,-96.622394846504761,83.377605153495239,null,1000000000,226494975.0625,null,31.628330912189334,-31.560884106921851,null,46.337484456323864,-65.0615107395829,null,0,0]
[15136,15.135999999999999,6.8067520428395261,1.4233496998019783,1.0691696274368891,0.36167547938994388,1,0,4993.2611471453756,1.5705960568756563,2.5013182210994982,1.1595094754483544,1.0096594671265144,0.13843661561707965,1,0,1,0,0.99760014295680266,7.3228875709367508E-2,19.943917443951712,-96.510517609544621,83.489482390455379,null,1000000000,229098496,null,31.619419295572712,-31.485359971156239,null,46.295345333203464,-65.025157638388393,null,0,0]
[15224,15.224,6.8454744532314074,1.4241897978067308,1.0699498862507237,0.36359820599833487,1,0,5022.2917340491786,1.5705972145052165,2.5135420623974096,1.1616296369496009,1.0097715679536547,0.13923114755608371,1,0,1,0,0.99757227467227361,7.3657455704821448E-2,19.892250855608889,-96.397156732743511,83.602843267256489,null,1000000000,231770176,null,31.610446055980866,-31.409473319243304,null,46.252651984452484,-64.987683413500193,null,0,0]
[15312,15.311999999999999,6.8842016405649078,1.4250204444224965,1.0707340947649968,0.36551812327556404,1,0,5051.3223209596363,1.5705983588286905,2.5257770928884877,1.1637292674091126,1.0098843060886493,0.14002550260178123,1,0,1,0,0.9975442475868509,7.4086085017728814E-2,19.841002879228352,-96.28458356416246,83.71541643583754,null,1000000000,234457344,null,31.601590712554319,-31.334752111749626,null,46.210259351498493,-64.949831452412838,null,0,0]
[15400,15.4,6.9229335246727768,1.4258417971269637,1.0715222443077783,0.36743522325141031,1,0,5080.3529078766323,1.5705994900741824,2.5380231507537414,1.1658086453688694,1.0099976813180849,0.14081967981110052,1,0,1,0,0.99751606174853347,7.451476393567677E-2,19.790168015079157,-96.172791599501551,83.827208400498449,null,1000000000,237160000,null,31.592850815943581,-31.261180348430734,null,46.168164383960033,-64.911611251070823,null,0,0]
[15488,15.488,6.9616700271622225,1.426654009943636,1.072314326189117,0.36934949806186035,1,0,5109.3834948000549,1.5706006084646122,2.550280077137844,1.1678680447238319,1.0101116934274386,0.14161367824228932,1,0,1,0,0.99748771720560336,7.4943492746295318E-2,19.739740868014518,-96.061774396500866,83.938225603499134,null,1000000000,239878144,null,31.584223976003706,-31.188742295075254,null,46.126364076835273,-64.873032101425608,null,0,0]
[15578.25,15.578250000000001,7.0014016683072207,1.4274776539565379,1.0731307354804496,0.37130977483227906,1,0,5139.1563410547878,1.5706017423261733,2.5628615163986428,1.1699596299227049,1.010229281907131,0.14242779109149795,1,0,1,0,0.99745848315195162,7.5383235496917514E-2,19.688442333663275,-95.948716731593322,84.051283268406678,null,1000000000,242681873.0625,null,31.57549154995862,-31.115613486393261,null,46.083797968529119,-64.833103245200078,null,0,0]
[15668.5,15.6685,7.0411380055246164,1.428292002122789,1.073951262196331,0.37326706370944479,1,0,5168.929187316051,1.5706028631257305,2.5754540579121468,1.1720307707261197,1.010347539790204,0.14324171390154755,1,0,1,0,0.99742908227813876,7.5823031337083624E-2,19.637561464375558,-95.836460430121477,84.163539569878523,null,1000000000,245501892.25,null,31.566873127589744,-31.043644418447599,null,46.041535521610271,-64.792816011673878,null,0,0]
[15758.75,15.758749999999999,7.0808789597544308,1.4290972098700347,1.0747758969065437,0.3752213565571384,1,0,5198.7020335837333,1.5706039710877016,2.5880575396198577,1.1740817479185988,1.0104664668416312,0.14405544566095144,1,0,1,0,0.9973995146371758,7.6262880577197073E-2,19.587092766586583,-95.724998748525408,84.275001251474592,null,1000000000,248338201.5625,null,31.558366313949829,-30.972818958374429,null,45.999573637461211,-64.752179790150947,null,0,0]
[15849,15.849,7.1206244536925682,1.4298934292037107,1.0756046301626498,0.37717264535557021,1,0,5228.4748798577239,1.570605066431392,2.6006718024653339,1.1761128375226688,1.0105860628251668,0.14486898535970966,1,0,1,0,0.99736978028238743,7.6702783527709581E-2,19.537030851418656,-95.614325013133339,84.385674986866661,null,1000000000,251190801,null,31.549968772489329,-30.903121245944437,null,45.957909263753784,-64.71120376718892,null,0,0]
[15941.25,15.94125,7.1612553472320437,1.4306981586538248,1.076455954635114,0.37916406313855289,1,0,5258.9075122051381,1.5706061732309282,2.613576585399187,1.1781686663511681,1.0107090002203065,0.14570035409698848,1,0,1,0,0.99733921475387988,7.7152490852305286E-2,19.486274431697797,-95.502006131182711,84.497993868817289,null,1000000000,254123451.5625,null,31.541495694019417,-30.833028265397406,null,45.915625922502841,-64.668977865785322,null,0,0]
[16033.5,16.0335,7.2018908259961067,1.4314938075085015,1.0773115413003931,0.38115232568041352,1,0,5289.3401445589188,1.570607267294349,2.6264923058641578,1.180204284722999,1.0108326360210027,0.14653152003779399,1,0,1,0,0.99730847515436405,7.7602254950265098E-2,19.435931961621666,-95.390496629074278,84.609503370925722,null,1000000000,257073122.25,null,31.533132027488918,-30.764080909613117,null,45.873647118957209,-64.626415719461122,null,0,0]
[16125.75,16.12575,7.2425308128061552,1.4322805276135206,1.0781713800116528,0.38313742479151858,1,0,5319.7727769189596,1.5706083488402314,2.6394188032952499,1.182219972583973,1.0109569699710192,0.14736248210834124,1,0,1,0,0.99727756154180724,7.8052076153299524E-2,19.385998008598747,-95.279789606453974,84.720210393546026,null,1000000000,260039813.0625,null,31.52487545612545,-30.696263089878286,null,45.831969737297761,-64.583526516575688,null,0,0]
[16218,16.218,7.2831752321977472,1.4330584674698821,1.0790354606040546,0.38511935240800038,1,0,5350.2054092851522,1.5706094180821792,2.6523559201248985,1.1842160050727224,1.0110820018127993,0.14819323923649808,1,0,1,0,0.99724647397452038,7.8501954793173082E-2,19.336467243399003,-95.169878239364266,84.830121760635734,null,1000000000,263023524,null,31.516723719946135,-30.629558992720426,null,45.790590708277328,-64.540319246643847,null,0,0]
[16312.5,16.3125,7.3248154978282036,1.4338464291886677,1.0799250040226138,0.387146322956818,1,0,5381.3803009836183,1.5706105008636626,2.665619425836061,1.1862406236127272,1.0112108065730541,0.14904404511342592,1,0,1,0,0.99721444786453017,7.8962865984925468E-2,19.28614100456517,-95.05810405578984,84.94189594421016,null,1000000000,266097656.25,null,31.508479558358026,-30.562366519919447,null,45.748508631031598,-64.49573753587039,null,0,0]
[16407,16.407,7.3664602599001503,1.4346254822288456,1.0808189771172667,0.38916994868984228,1,0,5412.5551926883218,1.5706115711720736,2.6788937499115995,1.1882451857191665,1.0113403431323615,0.14989463365662686,1,0,1,0,0.99718223933570782,7.9423838154439541E-2,19.236226861488777,-94.947150562163372,85.052849437836628,null,1000000000,269189649,null,31.500340782982686,-30.496310029155474,null,45.706733263330548,-64.450840533007892,null,0,0]
[16501.5,16.5015,7.4081094425832124,1.4353957758933287,1.0817173689054462,0.39119022134678322,1,0,5443.7300843991543,1.5706126292217033,2.69217873232521,1.1902299720770715,1.0114706112095626,0.15074500371903549,1,0,1,0,0.99714984845185806,7.9884871658530213E-2,19.186719406264203,-94.83701067112365,85.16298932887635,null,1000000000,272299502.25,null,31.492305139335098,-30.431373384916753,null,45.665261451753565,-64.405637286206925,null,0,0]
[16596,16.596,7.4497629717348293,1.4361574561879793,1.0826201683868455,0.39320713280418579,1,0,5474.9049761160122,1.570613675221961,2.7054742160665302,1.1921952584838937,1.0116016105220558,0.15159515415543945,1,0,1,0,0.99711727527716398,8.0345966854073192E-2,19.1376133338992,-94.727677378430073,85.272322621569927,null,1000000000,275427216,null,31.484370428594364,-30.367540731555764,null,45.6240900901293,-64.360136646874309,null,0,0]
[16692.5,16.692499999999999,7.4923024671459766,1.4369265163477114,1.0835466118926451,0.39526325326149708,1,0,5506.7396539070614,1.5706147311378753,2.7190617626691429,1.1941822965080124,1.0117361366244499,0.15246306935800888,1,0,1,0,0.99708382467152934,8.0816884712767489E-2,19.087876786265696,-94.616855346167668,85.383144653832332,null,1000000000,278639556.25,null,31.476369718550359,-30.303480216576425,null,45.582354252539794,-64.313375129591265,null,0,0]
[16789,16.789000000000001,7.5348463438681961,1.4376868922899479,1.0844776283961701,0.39731585205382242,1,0,5538.5743317041815,1.5706157749153797,2.7326599382113637,1.1961495665643367,1.0118714246412239,0.15333075313212902,1,0,1,0,0.99705018411386759,8.1287867654178642E-2,19.038547927284021,-94.506859916172061,85.493140083827939,null,1000000000,281870521,null,31.468469795273428,-30.240538367369485,null,45.54092531683505,-64.266321548802551,null,0,0]
[16885.5,16.8855,7.5773945281038406,1.4384387294174179,1.0854132061299122,0.399364920969763,1,0,5570.4090095072661,1.5706168067625859,2.7462685848053043,1.198097347181486,1.012007474266813,0.15419820426436198,1,0,1,0,0.9970163536737483,8.1758916058522091E-2,18.989621423869231,-94.397683895553712,85.602316104446288,null,1000000000,285120110.25,null,31.460668486871931,-30.17869916781958,null,45.499800121821757,-64.218984727734153,null,0,0]
[16982,16.981999999999999,{"$f":"SQRT(1+(A269/pole1)^2)","v":7.6199469476961594},{"$f":"ATAN(A269/pole1)","v":1.4391821699240426},{"$f":"SQRT(1+(A269/Zero1)^2)","v":1.0863533333093474},{"$f":"ATAN(A269/Zero1)","v":0.40141045194470359},{"$f":"IF(VIN_nom>Vout, 1, SQRT(1+(A269/z_RHP)^2))","v":1},{"$f":"IF(VIN_nom>Vout, 0, -ATAN(A269/z_RHP))","v":0},{"$f":"SQRT(1+(A269/Pole2)^2)","v":5602.2436873162142},{"$f":"ATAN(A269/Pole2)","v":1.5706178268828748},2.7598875475567861,1.2000259119882453,{"$f":"SQRT(1+(A269/pole4)^2)","v":1.0121442851940974},{"$f":"ATAN(A269/pole4)","v":0.15506542154332095},{"$f":"IF(VOUT_setting=1,1,SQRT(1+(A269*zterm1)^2))","v":1},{"$f":"IF(VOUT_setting=1,0,ATAN(((A269*zterm1))))","v":0},1,{"$f":"IF(VOUT_setting=1,0,ATAN(A269*$Q$4/(1+Afbr-$Q$5*(A269)^2)))","v":0},{"$f":"SQRT((1-(Z269/pterm2))^2+(A269/pterm1)^2)","v":0.99698233342115428},{"$f":"IF((ATAN((A269/pterm1)/(1-A269^2/pterm2))>0),ATAN((A269/pterm1)/(1-A269^2/pterm2)),PI()+ATAN((A269/pterm1)/(1-A269^2/pterm2)))","v":8.2230030306080643E-2},{"$f":"20*LOG10(((E269*K269*G269*O269)/(C269*I269*S269*M269*Q269))*Adc)","v":18.94109204409601},{"$f":"((F269+L269+H269+P269)-(D269+J269+T269+N269+R269))*radconv","v":-94.289320179752337},{"$f":"IF(V269>0,V269,V269+180)","v":85.710679820247663},null,{"$f":"IF(U269<0,A269,1000000000)","v":1000000000},{"$f":"A269^2","v":288388324},null,{"$f":"20*LOG10((K269/(I269*M269))*AEA)","v":31.452963675292096},{"$f":"(L269-(J269+N269))*radconv","v":-30.11794688239771},null,{"$f":"20*LOG10((E269*G269/(C269*S269))*Acs*Am)","v":45.458975553628377},{"$f":"(F269+H269-(D269+T269))*radconv","v":-64.171373297354606},null,{"$f":"SUM((U270<0)*(U269>0))*A269","v":0},0]
[17081,{"$f":"A270/1000","v":17.081},7.6636060889934798,1.4399362905662636,1.0873225315099886,0.40350529103826938,1,0,5634.903097716875,1.5706188614529186,2.7738698944149895,1.2019847523721587,1.0122854312638068,0.15595486130428629,1,0,1,0,0.99694723463635104,8.2713418408616735E-2,18.891712735785141,-94.178985903184568,85.821014096815432,null,1000000000,291760561,null,31.445157371344372,-30.0567340165213,null,45.417402549265233,-64.122251886663264,null,0,0]
[17180,17.18,7.7072695391899773,1.4406818670955901,1.0882964927524084,0.40559638977952134,1,0,5667.5625081234975,1.5706198840995129,2.7878627779791447,1.2039239364514036,1.0124273779319863,0.15684405236197771,1,0,{"$f":"IF(VOUT_setting=1,1,SQRT((1+Afbr-$Q$5*(A271)^2)^2+(A271*$Q$4)^2))","v":1},0,0.99691193622738894,8.3196876621196708E-2,18.842740554268946,-94.06949169890737,85.93050830109263,null,1000000000,295152400,null,31.437448279864036,-29.996632441133205,null,45.376139459229364,-64.072859257774169,null,0,0]
[17279,17.279,7.7509372254655284,1.4414190430850078,1.0892752042601714,0.40768373993873486,1,0,5700.2219185359791,1.5706208950276039,2.8018660403842142,1.2058437442482726,1.0125701248619423,0.15773299341518832,1,0,1,0,0.99687643827118766,8.3680405354654888E-2,18.794170165947534,-93.960830181207768,86.039169818792232,null,1000000000,298563841,null,31.429834280454173,-29.937626049326774,null,45.335183070317825,-64.023204131881016,null,0,0]
[17378,17.378,7.7946090766248615,1.442147958926834,1.090258653240517,0.40976733344632499,1,0,5732.8813289542204,1.5706218944374675,2.8158795267894523,1.2077444507883603,1.0127136717152718,0.15862168316502334,1,0,1,0,0.99684074084512486,8.4164005019901816E-2,18.745996338490556,-93.852994059117563,86.147005940882437,null,1000000000,301994884,null,31.422313305721495,-29.879699020349907,null,45.294530217593518,-63.973295038767645,null,0,0]
[17479.25,17.47925,7.8392777052572109,1.4428850402337507,1.0912693401860296,0.41189438741947115,1,0,5766.282998706004,1.5706229048512916,2.8302219184324207,1.2096688793343475,1.0128613080427027,0.15953030912247879,1,0,1,0,0.99680402587356032,8.4658669383193969E-2,18.697132484142173,-93.74355336317754,86.25644663682246,null,1000000000,305524180.5625,null,31.41471551906492,-29.821555711589816,null,45.25326414990171,-63.921997651587709,null,0,0]
[17580.5,17.580500000000001,7.8839505446194966,1.4436137688832857,1.0922849552754379,0.41401749548065053,1,0,5799.6846684636066,1.5706239036267211,2.8445746858721948,1.2115738948374335,1.0130097803454303,0.16043866948322741,1,0,1,0,0.99676710242746791,8.5153408808700537E-2,18.648672664305113,-93.634960881097413,86.365039118902587,null,1000000000,309073980.25,null,31.407210822634312,-29.764508803855485,null,45.212309026495262,-63.8704520772419,null,0,0]
[17681.75,17.681750000000001,7.9286275235372576,1.4443342852938739,1.0933054847748935,0.41613664951294427,1,0,5833.0863382269281,1.5706248909636893,2.8589376728394749,1.213459775952586,1.0131590882559331,0.16134676286535501,1,0,1,0,0.99672997059111013,8.564822373624037E-2,18.600611594179274,-93.527209115049672,86.472790884950328,null,1000000000,312644283.0625,null,31.399797166995572,-29.708542263670783,null,45.171661612008158,-63.818666851378886,null,0,0]
[17783,17.783000000000001,7.973308572424763,1.4450467267709735,1.0943309149354463,0.41825184157169204,1,0,5866.4880079958712,1.570625867057575,2.8733107260794104,1.2153267963095389,1.0133092314048389,0.16225458788952082,1,0,1,0,0.99669263044925271,8.6143114605717469E-2,18.552944089063793,-93.420290666792866,86.579709333207134,null,1000000000,316235089,null,31.392472554208808,-29.653640345370754,null,45.131318719679442,-63.766650321422091,null,0,0]
[17886.5,17.886500000000002,8.0189866693121736,1.4457667939869545,1.0953841833284099,0.42040993478809202,1,0,5900.6319370987248,1.5706268534206129,2.8880134283115191,1.2172160916631609,1.0134635739675419,0.16318230800011027,1,0,1,0,0.99665424531480218,8.6649082000291755E-2,18.504618790752044,-93.311849953624304,86.688150046375696,null,1000000000,319926882.25,null,31.385075177184273,-29.598602656636974,null,45.090390798392228,-63.713247296987312,null,0,0]
[17990,17.989999999999998,8.0646688769176471,1.4464787039466005,1.0964425435114999,0.42256387174624865,1,0,5934.7758662072529,1.5706278284341706,{"$f":"SQRT(1+(A279/Zero2)^2)","v":2.9027263346753562},{"$f":"ATAN(A279/Zero2)","v":1.219086241278825},1.0136187885163985,0.16410974478678803,1,0,1,0,0.99661564269468728,8.7155129679336835E-2,18.456694097162874,-93.204264686552534,86.795735313447466,null,1000000000,323640100,null,31.377766780813886,-29.544645054343391,null,45.049774501173452,-63.65961963220915,null,0,0]
[18093.5,18.093499999999999,8.110355125779364,1.4471825937734717,1.0975059807541876,0.42471364451302912,1,0,5968.919795321357,1.5706287922930153,2.9174492907904193,1.2209375218329825,1.013774874650891,0.16503689678460839,1,0,1,0,0.9965768226810805,8.7661258113018961E-2,18.40916477850265,-93.097527278483597,86.902472721516403,null,1000000000,327374742.25,null,31.370545388186024,-29.491751613321156,null,45.00946657514109,-63.605775665162398,null,0,0]
[18197,18.196999999999999,8.1560453479857955,1.4478785975506581,1.0985744803124542,0.42685924533990266,1,0,6003.0637244409445,1.5706297451874829,2.9321821452724803,1.2227702049644609,1.0139318319684998,0.16596376253148371,1,0,1,0,0.99653778536670379,8.8167467771599381E-2,18.36202570371811,-92.991630246090267,87.008369753909733,null,1000000000,331130809,null,31.363409072286878,-29.439906696945894,null,44.96946381625569,-63.551723549144356,null,0,0]
[18303,18.303000000000001,8.2028432478392457,1.4485833759278881,1.0996740208294296,0.42905234005639514,1,0,6038.0323861535462,1.5706307099282391,2.9472809705951568,1.2246281577815361,1.0140934831048509,0.16691271810934241,1,0,1,0,0.99649757998211086,8.8685989399605106E-2,18.314147240834146,-92.884038672195729,87.115961327804271,null,1000000000,334999809,null,31.356186603068998,-29.387880267063952,null,44.928807822589611,-63.496158405131737,null,0,{"$f":"IF(AH282>0,W282,0)","v":0}]
[18409,18.408999999999999,8.2496451759203389,1.449280157943557,1.1007788398283853,0.43124104299430327,1,0,6073.001047871704,1.5706316635589386,2.9623898661676984,1.2264671648871195,1.0142560471577353,0.16786137034574658,1,0,1,0,0.99645714687097164,8.9204597222536042E-2,18.2666675148538,-92.777313002080021,87.222686997919979,null,1000000000,338891281,null,31.349049433036846,-29.336921329747128,null,44.888465266641411,-63.440391672332872,null,0,0]
[18515,18.515000000000001,8.2964510640569795,1.4499690782539327,1.1018889214317669,0.43342534642598263,1,0,6107.9697095953197,1.5706326062703995,2.9775086786904499,1.2282875023471409,1.0144195236882594,0.16880971767948069,1,0,1,0,0.99641648613468603,8.9723291745872805E-2,18.219581319967961,-92.671445526771663,87.328554473228337,null,1000000000,342805225,null,31.341995645431201,-29.287013989064768,null,44.848432859361225,-63.38443153770686,null,0,0]
[18621,18.620999999999999,8.3432608456011561,1.4506502685235683,1.1030042497504597,0.43560524282274959,1,0,6142.9383713243042,1.570633538249095,2.9926372578620288,1.2300894411456067,1.0145839122553502,0.16975775855252631,1,0,1,0,0.99637559787525953,9.0242073475202675E-2,18.172883548496376,-92.566428645599999,87.433571354400001,null,1000000000,346741641,null,31.33502337217697,-29.238142640193221,null,44.808707361143867,-63.328286005406781,null,0,0]
[18729.5,18.729500000000002,8.3911785956445755,1.4513396533190595,1.1041513001755101,0.43783198004985763,1,0,6178.7317656466967,1.5706344812831807,3.0081326042190915,1.231915101458245,1.0147531220042834,0.17072783986954773,1,0,1,0,0.99633350974161394,9.0773181465885117E-2,18.12548145638268,-92.459808052238273,87.540191947761727,null,1000000000,350794170.25,null,31.327969179004327,-29.189175606521431,null,44.76835946220281,-63.270632445716871,null,0,0]
[18838,18.838000000000001,8.439100288318917,1.4520212090495259,1.1053038139998121,0.44005408458349982,1,0,6214.5251599745225,1.5706354134542031,3.0236378740063747,1.2337220437038277,1.0149232863755751,0.17169759680678487,1,0,1,0,0.99629118344426038,9.1304381896830725E-2,18.078475800909676,-92.35406287495708,87.64593712504292,null,1000000000,354870244,null,31.320996580005446,-29.141261831093487,null,44.728326405728687,-63.2128010438636,null,0,0]
[18946.5,18.9465,8.487025856838402,1.4526950677066992,1.1064617741509915,0.44227154899017185,1,0,6250.3185543076852,1.5706363349487886,3.0391529153406429,1.2355105426619972,1.0150944048891439,0.17266702770385542,1,0,1,0,0.99624861909456919,9.1835675310600301E-2,18.031861408017903,-92.249185305166591,87.750814694833409,null,1000000000,358969862.25,null,31.314103721005697,-29.094385485755577,null,44.688604871836674,-63.154799819411004,null,0,0]
[19055,19.055,8.534955235911978,1.4533613583457523,1.107625163547558,0.4444843660499096,1,0,6286.1119486460957,1.5706372459493139,3.0546775793296339,1.2372808680036449,1.0152664770625408,0.17363613090394475,1,0,1,0,0.99620581680457765,9.2367062249874135E-2,17.985633200940342,-92.145167646467286,87.854832353532714,null,1000000000,363093025,null,31.307288795189613,-29.048531035024688,null,44.649191590575192,-63.096636611442612,null,0,0]
[19165.75,19.165749999999999,8.5838824058211713,1.4540337920524768,1.1088182600786605,0.44673827083850004,1,0,6322.6476023194236,1.5706381652038881,3.0705339558318823,1.2390694371527686,1.0154431005788505,0.17462499103661266,1,0,1,0,0.99616188163370523,9.2909565752460607E-2,17.938839452983412,-92.039871906929278,87.960128093070722,null,1000000000,367325973.0625,null,31.300411091826344,-29.002763752898318,null,44.609275545981532,-63.03710815403096,null,0,0]
[19276.5,19.276499999999999,8.6328134130827525,1.4546986033140712,1.1100169773771162,0.44898731900790984,1,0,6359.1832559980321,1.5706390738956066,3.0864000539644603,1.2408396231052734,1.0156207166945443,0.17561350626339411,1,0,1,0,0.996117698789728,9.3452167842658987E-2,17.892437684532972,-91.93545625861411,88.06454374138589,null,1000000000,371583452.25,null,31.293610928113971,-28.958029383494679,null,44.569673941243465,-62.977426875119413,null,0,0]
[19387.25,19.387250000000002,8.6817481928138722,1.4553559204298672,1.1112212972529094,0.45123150355973596,1,0,6395.718909681832,1.5706399722054913,3.102275724568154,1.2425916969053112,1.0157993248889439,0.17660167483384226,1,0,1,0,0.99607326839395172,9.3994869098004627E-2,17.846422794490589,-91.831912866993889,88.168087133006111,null,1000000000,375865462.5625,null,31.28688652619061,-28.914312307206345,null,44.530383453124443,-62.917600559787545,null,0,0]
[19498,19.498000000000001,8.7306866815813944,1.4560058688487876,1.1124312015099616,0.45347081772176867,1,0,6432.2545633707341,1.5706408603104507,3.1181608214323564,1.244325924523638,1.0159789246388298,0.17758949500144589,1,0,1,0,0.99602859056840798,9.4537670096165094E-2,17.800789777160652,-91.729234011946005,88.270765988053995,null,1000000000,380172004,null,31.280236153730385,-28.87159719509992,null,44.491400808254724,-62.857636816846103,null,0,0]
[19611.75,19.611750000000001,8.7809546138634591,1.4566658811286783,1.1136796739136325,0.45576571356025336,1,0,6469.7798961715544,1.5706417620307114,3.1344858765654036,1.2460888252354567,1.0161644210491636,0.17860370876008239,1,0,1,0,0.99598244506313782,9.5095278946454115E-2,17.754313020474633,-91.624665779835865,88.375334220164135,null,1000000000,384620738.0625,null,31.27348092741002,-28.828752257222359,null,44.45167927788907,-62.79591352261351,null,0,0]
[19725.5,19.7255,8.831226327724977,1.4573183794565903,1.1149339984100701,0.45805545782183044,1,0,6507.3052289775742,1.570642653351167,3.1508205721508289,1.2478334526260271,1.0163509623340756,0.17961755126322493,1,0,1,0,0.99593603880507975,9.5652994252132598E-2,17.708228699833441,-91.520993409997388,88.479006590002612,null,1000000000,389095350.25,null,31.266800232825894,-28.786932436293316,null,44.412275651832005,-62.734060973704089,null,0,0]
[19839.25,19.83925,8.881501758951643,1.45796349087461,1.1161941552703858,0.46034004390437699,1,0,6544.8305617887054,1.5706435344507022,3.1671647590263392,1.2495600788910723,1.0165385479183422,0.18063102063162292,1,0,1,0,0.99588937192884763,9.6210816639535179E-2,17.662531690375186,-91.418208902476181,88.581791097523819,null,1000000000,393595840.5625,null,31.260192334194574,-28.746122039222833,null,44.373186541005069,-62.672086863253341,null,0,0]
[19953,19.952999999999999,8.9317808447702642,1.4586013395891382,1.1174601247631555,0.46261946545085864,1,0,6582.3558946048588,1.570644405504122,3.183518291007053,1.2512689710675193,1.0167271772239457,0.18164411499047475,1,0,1,0,0.99584244456986537,9.6768746735146557E-2,17.61721696313376,-91.31630437640942,88.68369562359058,null,1000000000,398122209,null,31.253655540583733,-28.706305668519416,null,44.334408607374492,-62.609998707889986,null,0,0]
[20069,20.068999999999999,8.9830581620817611,1.4592444513674396,1.118757101186761,0.46493864934009665,1,0,6620.6234867565272,1.5706452836181017,3.2002047751335687,1.2529936733449039,1.0169206119496375,0.18267686042996539,1,0,1,0,0.99579432085632436,9.7337824385295424E-2,17.571394484147302,-91.213282371552637,88.786717628447363,null,1000000000,402764761,null,31.247060968795402,-28.666709774282598,null,44.29518070017636,-62.546572597270014,null,0,0]
[20185,20.184999999999999,9.0343391525450887,1.4598802625049836,1.1200600810183805,0.46725244977934394,1,0,6658.8910789132406,1.5706461516393178,3.2169006798102755,1.2547004780420004,1.0171151308721569,0.18370921195386955,1,0,1,0,0.99574592654033378,9.7907015363173686E-2,17.525959291286281,-91.11115932079862,88.88884067920138,null,1000000000,407434225,null,31.24053692773056,-28.628116187887574,null,44.256269548380189,-62.483043132911057,null,0,0]
[20301,20.300999999999998,9.0856237539643399,1.4605088961106321,1.1213690433309527,0.46956086080315845,1,0,6697.1586710749152,1.5706470097407801,3.2336058591153054,1.2563896525194547,1.017310733369579,0.18474116758832504,1,0,1,0,0.99569726176811957,9.8476320333669709E-2,17.480906344073702,-91.009927235837779,88.990072764162221,null,1000000000,412130601,null,31.234081759675995,-28.590509487516488,null,44.217671769222171,-62.419417748321308,null,0,0]
[20417,20.417000000000002,9.1369119055356816,1.4611304725520469,1.1226839671991531,0.47186387670360519,1,0,6735.4262632414639,1.5706478580915673,3.2503201700464435,1.2580614590454859,1.0175074188169948,0.18577272536435596,1,0,1,0,0.99564832668678616,9.9045739961837603E-2,17.436230695714627,-90.909578248385841,89.090421751614159,null,1000000000,416853889,null,31.227693849824234,-28.553874543180733,null,44.17938403071485,-62.355703705205144,null,0,0]
[20536,20.536000000000001,9.1895301015807149,1.4617609142967658,1.1240390706071437,0.47422084142607085,1,0,6774.6835345207492,1.570648718423445,3.2674760896900676,1.259758724060634,1.0177103156220677,0.18683054587461076,1,0,1,0,0.99559784531246287,9.963000580085167E-2,17.390786615957797,-90.80754355712358,89.19245644287642,null,1000000000,421727296,null,31.221208976688605,-28.517286365161276,null,44.14042482409365,-62.29025719196229,null,0,0]
[20655,20.655000000000001,9.2421519084773056,1.4623841772263813,1.1254004033119809,0.47657211701257829,1,0,6813.9408058049894,1.5706495688420337,3.2846413236383527,1.2614382543697387,1.0179143507742079,0.18788794349945209,1,0,1,0,0.99554707978318546,0.10021439372323131,17.345729348814007,-90.706421834664198,89.293578165335802,null,1000000000,426629025,null,31.214791575862549,-28.481689513411123,null,44.101784957775919,-62.224732321253093,null,0,0]
[20774,20.774000000000001,9.294777264897613,1.4630003827879905,1.1267679427354251,0.47891769813268159,1,0,6853.1980770941018,1.5706504095176927,3.3018157266237584,1.2631003171642405,1.0181195235890272,0.18894491612930664,1,0,1,0,0.99549603026065481,0.10079890444752458,17.30105384582086,-90.606204965945054,89.393795034054946,null,1000000000,431559076,null,31.208440036362145,-28.447068567879601,null,44.063460994283183,-62.159136398065478,null,0,0]
[20893,20.893000000000001,9.3474061108907982,1.4636096497152653,1.1281416663060231,0.48125757973235667,1,0,6892.4553483880027,1.5706512406169002,3.3189991563087369,1.2647451744927385,1.0183258333788752,0.19000146166009479,1,0,1,0,0.99544469690754722,0.1013835386924667,17.256755152252531,-90.506884959364072,89.493115040635928,null,1000000000,436517449,null,31.202152789213642,-28.413408403271564,null,44.025449547863346,-62.093476556092504,null,0,0]
[21014.75,21.014749999999999,9.4012547200593843,1.4642259363940808,1.1295535122228104,0.48364563063314353,1,0,6932.6198255360023,1.5706520811808815,3.3365888786217464,1.2664105047829601,1.018538086801942,0.19108197895245027,1,0,1,0,0.9953918837051231,0.10198181197775187,17.211817649644665,-90.406189725466447,89.593810274533553,null,1000000000,441619717.5625,null,31.195785193112822,-28.379949247419738,null,43.98687964135631,-62.026240478046702,null,0,0]
[21136.5,21.136500000000002,9.4551068592394518,1.464835203105195,1.1309717836386834,0.48602770571990694,1,0,6972.7843026888449,1.5706529120612669,3.3541877573130177,1.2680583641679473,1.0187515288898457,0.19216204473967743,1,0,1,0,0.99533877374995483,0.10258021608125371,17.167264371079945,-90.306416746269448,89.693583253730552,null,1000000000,446751632.25,null,31.189481701788246,-28.34746467653579,null,43.948629854116163,-61.958952069733641,null,0,0]
[21258.25,21.25825,9.508962468456426,1.4654375686686993,1.1323964564107687,0.48840380046361503,1,0,7012.9487798464443,1.5706537334244357,3.3717956490091048,1.26968901733265,1.0189661588956203,0.19324165678641628,1,0,1,0,0.99528536721943484,0.10317875177331037,17.123090299909748,-90.207557849419914,89.792442150580086,null,1000000000,451913193.0625,null,31.183240763312337,-28.315939406745287,null,43.910696721421864,-61.89161844267462,null,0,0]
[21380,21.38,9.5628214890829586,1.4660331492481389,1.1338275064088403,0.49077391062805786,1,0,7053.1132570087229,1.5706545454329772,3.3894124132431744,1.2713027238293806,1.0191819760687728,0.19432081286341549,1,0,1,0,0.9952316642920277,0.10377741982446916,17.07929051227698,-90.109604987801674,89.890395012198326,null,1000000000,457104400,null,31.177060866422153,-28.285358448385146,null,43.873076830679281,-61.824246539416571,null,0,0]
[21504.5,21.5045,9.6179005060445739,1.4666352840973089,1.1352974497098918,0.49319136212980763,1,0,7094.1849400254159,1.5706553662741651,3.407436124095605,1.2729356195698036,1.0194038948693513,0.195423870278009,1,0,1,0,0.99517644203453348,0.10438974783231975,17.03488343165235,-90.010368346384595,89.989631653615405,null,1000000000,462443520.25,null,31.170802974524499,-28.255047979191925,null,43.834927641952319,-61.75532036719266,null,0,0]
[21629,21.629000000000001,9.6729829704206285,1.46723056148844,1.1367740105895356,0.49560254761499467,1,0,7135.2566230468346,1.5706561776655656,3.4254688247371754,1.2745513274695948,1.0196270534742056,0.19652644619681503,1,0,1,0,0.99512091022022697,0.10500221587643371,16.990857606793703,-89.912062502972731,90.087937497027269,null,1000000000,467813641,null,31.164605841434149,-28.225694171617523,null,43.797098950184015,-61.686368331355169,null,0,0]
[21753.5,21.753499999999999,9.7280688236510677,1.4678190974885001,1.1382571632945648,0.49800746348691521,1,0,7176.3283060728972,1.5706569797694281,3.4435103739368547,1.2761501091824308,1.0198514510694729,0.19762853825604731,1,0,1,0,0.99506506904342462,0.10561482478144524,16.947208058777967,-89.814679243247326,90.185320756752674,null,1000000000,473214762.25,null,31.158467975140312,-28.197281907871805,null,43.759587268462113,-61.61739733537555,null,0,0]
[21878,21.878,9.783158008491208,1.468401005569077,1.1397468820911505,0.50040610645763162,1,0,7217.3999891035228,1.5706577727443092,3.4615606333393956,1.2777322212545796,1.0200770868374904,0.19873014409869544,1,0,1,0,0.99500891869961816,0.1062275753722218,16.903929900372596,-89.718210479317406,90.281789520682594,null,1000000000,478646884,null,31.152387922894732,-28.169796362974207,null,43.722389162302321,-61.54841411634321,null,0,0]
[22005.25,22.00525,9.8394674072699377,1.4689890333860169,1.1412762648007506,0.50285124613088972,1,0,7259.37887798886,1.5706585739623238,3.4800184530793175,1.2793323154028704,1.0203089851715517,0.19985557770924225,1,0,1,0,0.99495120880599996,0.10685400788825843,16.860074590037428,-89.620547607970295,90.379452392029705,null,1000000000,484231027.5625,null,31.146231843528653,-28.142646223839751,null,43.684689931333239,-61.477901384130568,null,0,0]
[22132.5,22.1325,9.8957801695873275,1.4695703689594048,1.1428124525812664,0.50528982675512091,1,0,7301.357766878803,1.570659365967191,3.4984850886854608,1.2809155214830239,1.020542175241536,0.20098049842933211,1,0,1,0,0.99489317635327668,0.10748059016160152,16.81659721678356,-89.523823386297153,90.476176613702847,null,1000000000,489847556.25,null,31.14013321202577,-28.116433785401767,null,43.647311189582254,-61.407389600895385,null,0,0]
[22259.75,22.25975,9.9520962383468188,1.4701451255014233,1.1443554180272268,0.50772184580057778,1,0,7343.3366557732734,1.5706601489169145,3.5169604012884328,1.2824820976445988,1.0207766561621765,0.20210490376439025,1,0,1,0,0.99483482155399783,0.10810732307375692,16.773492844661465,-89.428029571572708,90.571970428427292,null,1000000000,495496470.0625,null,31.134090596713229,-28.091144122904375,null,43.610249432772704,-61.33688544866834,null,0,0]
[22387,22.387,10.008415557733635,1.470713413693598,1.145905133760178,0.51014730106158512,1,0,7385.3155446721948,1.5706609229659056,3.5354442548570475,1.2840322969688864,1.0210124270441212,0.20322879122733997,1,0,1,0,0.9947761446219997,0.10873420750648982,16.730756628177147,-89.333158048136852,90.666841951863148,null,1000000000,501177769,null,31.128102603737435,-28.066762602205813,null,43.57350120926418,-61.266395445931053,null,0,0]
[22517.5,22.517499999999998,10.066176607097187,1.4712896112009133,1.1475014121057387,0.51262788375829826,1,0,7428.3665859443945,1.5706617076977571,3.5544089225164708,1.2856053391091975,1.0212555584443506,0.20438084260708037,1,0,1,0,0.99471563471154634,0.10937726103877604,16.687306314302514,-89.236813035536471,90.763186964463529,null,1000000000,507037806.25,null,31.122016987135734,-28.042686570206733,null,43.536136511991245,-61.194126465329731,null,0,0]
[22648,22.648,10.123940960331726,1.4718592336544514,1.1491047317182319,0.51510155944007752,1,0,7471.4176272211153,1.5706624833862051,3.5733822920552294,1.2871616804952095,1.021500044631541,0.20553234404973009,1,0,1,0,0.99465478646323036,0.11002047580952261,16.644233161588179,-89.141421136706526,90.858578863293474,null,1000000000,512931904,null,31.115985966336034,-28.01953539372159,null,43.499094380076606,-61.121885742984972,null,0,0]
[22778.5,22.778500000000001,10.181708561205248,1.4724223925953324,1.1507150631653462,0.51756832676819287,1,0,7514.4686685022807,1.5706632501866804,3.5923642255942347,1.2887015782657558,1.0217458846331609,0.2066832928974815,1,0,1,0,0.99459360011192111,0.11066385277065452,16.601532225596184,-89.046973997381883,90.953026002618117,null,1000000000,518860062.25,null,31.110008154364543,-27.997294196404837,null,43.462371256056109,-61.049679800977032,null,0,0]
[22909,22.908999999999999,10.239479354751582,1.4729791970640433,1.1523323770509342,0.52002818474767465,1,0,7557.5197097878136,1.570664008251073,3.611354588091682,1.290225284466608,1.0219930774722317,0.20783368650093356,1,0,1,0,0.99453207589391701,0.11130739287438909,16.559198652357431,-88.953463392431885,91.046536607568115,null,1000000000,524822281,null,31.104082201149982,-27.975948394000646,null,43.425963636031909,-60.977514998431246,null,0,0]
[23042.25,23.042249999999999,10.298470778969572,1.4735412889799389,1.1539909464561258,0.52253274885447643,1,0,7601.4779569286211,1.5706647734300707,3.6307536904743825,1.2917646491542514,1.022246874235947,0.20900774645265244,1,0,1,0,0.99446890681418121,0.11196466349341688,16.516347097177182,-88.858940188354197,91.141059811645803,null,1000000000,530945285.0625,null,31.098083515531719,-27.95506181589931,null,43.389110766469926,-60.903878372454891,null,0,0]
[23175.5,23.1755,10.357465419897181,1.4740969778794994,1.1556567338591246,0.52503010832876884,1,0,7645.4362040738279,1.5706655298101126,3.6501613049885679,1.2932876480621169,1.0225020793812634,0.21018122195662964,1,0,1,0,0.99440538598059947,0.11262210621063659,16.473868601342851,-88.765376473578968,91.234623526421032,null,1000000000,537103800.25,null,31.092136165278013,-27.935078937376737,null,43.352579620889301,-60.830297536202231,null,0,0]
[23308.75,23.30875,10.416463222879985,1.4746463722147203,1.1573297080925384,0.52752026319645151,1,0,7689.3944512233593,1.5706662775421028,3.6695772965776765,1.2947945338457969,1.0227586918538965,0.21135411021972841,1,0,1,0,0.99434151364934587,0.11327972204069302,16.431758275194564,-88.672763891110847,91.327236108889153,null,1000000000,543297826.5625,null,31.086238825008209,-27.915985130945025,null,43.316366635010809,-60.75677876016583,null,0,0]
[23442,23.442,10.475464134491901,1.4751895780096587,1.1590098380348486,0.53000321384067128,1,0,7733.3526983771408,1.5706670167735139,3.6890015329707859,1.2962855541356677,1.0230167105948087,0.21252640845806953,1,0,1,0,0.99427729007815324,0.11393751199855481,16.390011318016143,-88.581094212651152,91.418905787348848,null,1000000000,549527364,null,31.080390204709019,-27.897766057373744,null,43.280468298131581,-60.683328155277408,null,0,0]
[23578.5,23.578499999999998,10.535907261421299,1.4757397242814418,1.1607383339059802,0.53253925509308542,1,0,7778.383097904858,1.5706677653715047,3.7089079447138737,1.2977967438096893,1.0232824794991422,0.21372668464958544,1,0,1,0,0.99421113615479273,0.11461152722535486,16.347617986382573,-88.488157900585904,91.511842099414096,null,1000000000,555945662.25,null,31.074448139605973,-27.879994918517557,null,43.244017031601061,-60.608162982068357,null,0,0]
[23715,23.715,10.596353540778694,1.4762835941617751,1.1624742728433637,0.53506773835600463,1,0,7823.4134974368844,1.570668505351859,3.728822736022694,1.2992917950292453,1.0235497218418115,0.21492633579963741,1,0,1,0,0.99414461420142464,0.11528572733477704,16.305596043528432,-88.3961939710114,91.6038060289886,null,1000000000,562401225,null,31.068554568687937,-27.863112138999046,null,43.207888659664953,-60.533081832012364,null,0,0]
[23851.5,23.851500000000001,10.656802918921576,1.4768212941322725,1.1642176215524285,0.53758866518009152,1,0,7868.4438969731455,1.5706692368625306,3.7487457733507403,1.3007709583648099,1.0238184364690033,0.2161253589460507,1,0,1,0,0.9940777245002016,0.11596011341894875,16.263940605008528,-88.305193980728887,91.694806019271113,null,1000000000,568894052.25,null,31.062708213633524,-27.847103200944542,null,43.172079576199465,-60.458090779784371,null,0,0]
[23988,23.988,10.717255343414976,1.4773529282864961,1.1659683467960398,0.54010203749092567,1,0,7913.4742965135692,1.570669960048106,3.768676925920754,1.3022344793675513,1.0240886222217622,0.21732375113697383,1,0,1,0,0.99401046733499909,0.11663468657036057,16.222646874999679,-88.215149616237696,91.784850383762304,null,1000000000,575424144,null,31.056907830446249,-27.831953874464002,null,43.136586229377883,-60.38319574177369,null,0,0]
[24127.75,24.127749999999999,10.779150213840145,1.4778910424829934,1.1677683634023082,0.54266742794066869,1,0,7959.5768484282416,1.5706706919751476,3.7890909033895457,1.3037168919520479,1.0243667638358043,0.21855001973533814,1,0,1,0,0.99394122841511134,0.11732551592970235,16.180739773038997,-88.123942816546773,91.876057183453227,null,1000000000,582148320.0625,null,31.051015705571807,-27.817319841424634,null,43.100571252291651,-60.306622975122146,null,0,0]
[24267.5,24.267499999999998,10.84104816990903,1.4784230120076252,1.1695760416731402,0.54522490512452448,1,0,8005.6794003471286,1.5706714154722476,3.8095131183129749,1.3051834137580489,1.0246464449880448,0.21977562074647006,1,0,1,0,0.99387160493238025,0.11801654368900021,16.139201910619633,-88.033720458920271,91.966279541079729,null,1000000000,588911556.25,null,31.045169234509046,-27.803557549996295,null,43.064879860935044,-60.230162908923965,null,0,0]
[24407.25,24.407250000000001,10.902949159068408,1.4789489412149823,1.1713913461383472,0.54777447229963461,1,0,8051.7819522701593,1.5706721306842097,3.8299434389185474,1.3066342927282211,1.0249276644181609,0.22100055103644903,1,0,1,0,0.99380159719706884,0.11870777102184642,16.098028415813829,-87.944474025725043,92.055525974274957,null,1000000000,595713852.5625,null,31.039367187242945,-27.790652622846814,null,43.029508413395348,-60.153821402878236,null,0,0]
[24547,24.547000000000001,{"$f":"SQRT(1+(A333/pole1)^2)","v":10.964853129949249},{"$f":"ATAN(A333/pole1)","v":1.4794689321165884},{"$f":"SQRT(1+(A333/Zero1)^2)","v":1.1732142413980911},{"$f":"ATAN(A333/Zero1)","v":0.55031613311436034},{"$f":"IF(VIN_nom>Vout, 1, SQRT(1+(A333/z_RHP)^2))","v":1},{"$f":"IF(VIN_nom>Vout, 0, -ATAN(A333/z_RHP))","v":0},{"$f":"SQRT(1+(A333/Pole2)^2)","v":8097.8845041972609},{"$f":"ATAN(A333/Pole2)","v":1.5706728377525396},3.8503817361787851,1.3080697718073666,{"$f":"SQRT(1+(A333/pole4)^2)","v":1.0252104208602848},{"$f":"ATAN(A333/pole4)","v":0.22222480748283463},{"$f":"IF(VOUT_setting=1,1,SQRT(1+(A333*zterm1)^2))","v":1},{"$f":"IF(VOUT_setting=1,0,ATAN(((A333*zterm1))))","v":0},1,{"$f":"IF(VOUT_setting=1,0,ATAN(A333*$Q$4/(1+Afbr-$Q$5*(A333)^2)))","v":0},{"$f":"SQRT((1-(Z333/pterm2))^2+(A333/pterm1)^2)","v":0.99373120552134009},{"$f":"IF((ATAN((A333/pterm1)/(1-A333^2/pterm2))>0),ATAN((A333/pterm1)/(1-A333^2/pterm2)),PI()+ATAN((A333/pterm1)/(1-A333^2/pterm2)))","v":0.1193991991022396},{"$f":"20*LOG10(((E333*K333*G333*O333)/(C333*I333*S333*M333*Q333))*Adc)","v":16.057214504822333},{"$f":"((F333+L333+H333+P333)-(D333+J333+T333+N333+R333))*radconv","v":-87.856195129513523},{"$f":"IF(V333>0,V333,V333+180)","v":92.143804870486477},null,{"$f":"IF(U333<0,A333,1000000000)","v":1000000000},{"$f":"A333^2","v":602555209},null,{"$f":"20*LOG10((K333/(I333*M333))*AEA)","v":31.033608366977905},{"$f":"(L333-(J333+N333))*radconv","v":-27.778590969469374},null,{"$f":"20*LOG10((E333*G333/(C333*S333))*Acs*Am)","v":42.994453322668889},{"$f":"(F333+H333-(D333+T333))*radconv","v":-60.077604160044167},null,{"$f":"SUM((U334<0)*(U333>0))*A333","v":0},0]
[24690,{"$f":"A334/1000","v":24.69},11.028199762221725,1.4799949727946105,1.1750873503605304,0.55290872222934773,1,0,8145.0592084989039,1.5706735529786586,3.8713034679526706,1.3095229411791083,1.0255013427516437,0.2234768342322033,1,0,1,0,0.99365877972002292,0.12010691593520489,16.015818757619556,-87.766856169529092,92.233143830470908,null,1000000000,609596100,null,31.027759152560467,-27.767107325552104,null,42.958906789883542,-59.999748843977002,null,0,0]
[24833,24.832999999999998,11.091549411345689,1.4805150046273994,1.1769683325231797,0.55549304193111382,1,0,8192.2339128046642,1.5706742599675663,3.8922332868670693,1.3109604852197718,1.0257938712758576,0.22472814885418557,1,0,{"$f":"IF(VOUT_setting=1,1,SQRT((1+Afbr-$Q$5*(A335)^2)^2+(A335*$Q$4)^2))","v":1},0,0.99358595258035143,0.12081484544975717,15.974789652626086,-87.678512907981258,92.321487092018742,null,1000000000,616677889,null,31.021952765815723,-27.756477673308911,null,42.923684071634824,-59.922035234672336,null,0,0]
[24976,24.975999999999999,11.154902025922263,1.481029129710304,1.1788571501986509,0.55806909736644472,1,0,8239.4086171144736,1.5706749588607494,3.9131710631583845,1.312382648753984,1.0260880050588168,0.22597874804093968,1,0,1,0,0.99351272444296923,0.12152298890505463,15.934122337147896,-87.591156762921329,92.408843237078671,null,1000000000,623800576,null,31.016188025867795,-27.746687803903185,null,42.888781496104556,-59.844468959018116,null,0,0]
[25119,25.119,11.218257555711247,1.4815374478449774,1.1807537657842142,0.56063689408799744,1,0,8286.5833214282611,1.5706756497964718,3.9341166697766661,1.3137896716443411,1.0263837427204499,0.22722862849735695,1,0,1,0,0.99343909565061161,0.12223134756070909,15.89381204597413,-87.504779282601092,92.495220717398908,null,1000000000,630964161,null,31.010463783906111,-27.737723793346593,null,42.854195446892476,-59.767055489254481,null,0,0]
[25265.25,25.265250000000002,11.283055948072782,1.4820514139274388,1.1827015129329383,0.56325451363838253,1,0,8334.8301781168611,1.5706763483453028,3.9555462825628984,1.3152132565237933,1.0266878592186504,0.22850616848892352,1,0,1,0,0.993363379418855,0.1229560291822568,15.852950022827324,-87.417442283841069,92.582557716158931,null,1000000000,638332857.5625,null,31.004650169872654,-27.729396061541571,null,42.819147037779118,-59.688046222299484,null,0,0]
[25411.5,25.4115,11.347857286939776,1.4825595101905831,1.1846573371922113,0.56586350783548134,1,0,8383.0770348094811,1.5706770388534619,3.9769838252356715,1.3166214968412409,1.0269936503887591,0.22978294977875846,1,0,1,0,0.99328724484541919,0.12368093856359215,15.812451625940152,-87.331111462761143,92.668888537238857,null,1000000000,645744332.25,null,30.998876583391521,-27.721903577275143,null,42.784422227373085,-59.609207885486001,null,0,0]
[25557.75,25.557749999999999,11.412661522121262,1.4830618363611594,1.1866211986232345,0.5684638838987387,1,0,8431.323891506052,1.5706777214589835,3.9984291702469381,1.3180146338648515,1.0273011147353053,0.23105896888350136,1,0,1,0,0.99321069230374637,0.12440607705366127,15.772312028018103,-87.245778181607605,92.754221818392395,null,1000000000,653198585.0625,null,30.993141893186611,-27.715232325226509,null,42.750017319655953,-59.530545856381067,null,0,0]
[25704,25.704000000000001,11.477468604557613,1.483558489925304,1.1885930573875838,0.57105564946618514,1,0,8479.57074820651,1.5706783962967603,4.0198821927245021,1.3193929039497849,1.0276102507564289,0.23233422233387757,1,0,1,0,0.99313372216957618,0.12513144600191525,15.732526488471594,-87.161433932416259,92.838566067583741,null,1000000000,660695616,null,30.98744499885759,-27.7093685721965,null,42.715928674438466,-59.452065360219798,null,0,0]
[25853.75,25.853750000000002,11.543829525913281,1.4840612508839326,1.1906203511397351,0.57370052654688097,1,0,8528.9722305413597,1.5706790793733714,4.0418564484507504,1.3207889952220284,1.0279285154913722,0.23363919770295338,1,0,1,0,0.9930544777073802,0.1258744144140542,15.692150823480231,-87.076087254333345,92.923912745666655,null,1000000000,668416389.0625,null,30.981649814175626,-27.704187152899454,null,42.681348194129072,-59.371900101433901,null,0,0]
[26003.5,26.003499999999999,11.610193331829784,1.4845582644088418,1.1926559453785843,0.57633639359890942,1,0,8578.3737128801422,1.5706797545825246,{"$f":"SQRT(1+(A343/Zero2)^2)","v":4.0638384968372261},{"$f":"ATAN(A343/Zero2)","v":1.3221699857337954},1.0282485296628086,0.23494336301619176,1,0,1,0,0.9929747962308888,0.12661762731196038,15.652136576211166,-86.991759863464935,93.008240136535065,null,1000000000,676182012.25,null,30.975892016088014,-27.699824079893283,null,42.647091744947616,-59.291935783571638,null,0,0]
[26153.25,26.15325,11.67655997312386,1.4850496282532868,1.1946997976756752,0.57896326014427424,1,0,8627.7751952227918,1.5706804220593638,4.0858282121087193,1.3235361139891904,1.0285702916378565,0.23624671459538593,1,0,1,0,0.99289467815097476,0.12736108614596589,15.612478926539126,-86.90844302990611,93.09155697009389,null,1000000000,683992485.5625,null,30.970170517689262,-27.696265484896863,null,42.613155593674321,-59.212177545009254,null,0,0]
[26303,26.303000000000001,11.742929401722032,1.485535437971625,1.1967518657208562,0.58158113613691953,1,0,8677.1766775692431,1.5706810819359556,4.1078254711397832,1.3248876136081762,1.028893799776764,0.23754924877797609,1,0,1,0,0.99281412388104806,0.12810479236696748,15.573173140718943,-86.826128153609318,93.173871846390682,null,1000000000,691847809,null,30.964484261932498,-27.693497780189915,null,42.579536063610909,-59.132630373419389,null,0,0]
[26456,26.456,11.81074206509969,1.486026152061096,1.1988569107191629,0.58424655291655858,1,0,8727.6503122910071,1.5706817484185402,4.1303077988561556,1.3262535743434982,1.0292261306676678,0.23887920365654569,1,0,1,0,0.99273137129497657,0.12886489613231225,15.533372873001047,-86.743052808427819,93.256947191572181,null,1000000000,699919936,null,30.958709927164371,-27.691472983197162,null,42.545510130661135,-59.051579825230654,null,0,{"$f":"IF(AH346>0,W346,0)","v":0}]
[26609,26.609000000000002,11.878557540035221,1.486511263227533,1.2009704430394361,0.58690260702343222,1,0,8778.1239470166074,1.5706824072366632,4.1527977496508655,1.3276047425442652,1.0295602808560087,0.24020829759447743,1,0,1,0,0.99264816426089431,0.12962526120297341,15.493930184503391,-86.661005635122962,93.338994364877038,null,1000000000,708038881,null,30.952970241893496,-27.690245968597353,null,42.511807127434352,-58.970759666525616,null,0,0]
[26762,26.762,11.946375778647875,1.4869908666621459,1.2030924179513738,0.58954931042496872,1,0,8828.5975817459712,1.5706830585217786,4.1752952003402974,1.3289413523533975,1.029896248570972,0.24153652673639875,1,0,1,0,0.99256450322794076,0.13038588912822074,15.454840292582803,-86.579977862066869,93.420022137933131,null,1000000000,716204644,null,30.947264169329245,-27.68980310762452,null,42.478423308078021,-58.890174754442342,null,0,0]
[26915,26.914999999999999,12.014196734136098,1.4874650554169677,1.2052227908616422,0.59218667552849769,1,0,8879.0712164790384,1.5706837024023523,4.1978000303409253,1.3302636331033526,1.030234032034427,0.24286388724415783,1,0,1,0,0.99248038864803256,0.13114678145794986,15.41609849995246,-86.499960846331859,93.500039153668141,null,1000000000,724417225,null,30.941590701296189,-27.690131047947396,null,42.445354983480726,-58.809829798384449,null,0,0]
[27071.75,27.071750000000002,12.083682737692403,1.487945346172046,1.2074140415870382,0.59487901093787765,1,0,8930.7819501063968,1.5706843545165814,4.2208639787275555,1.3316036973707648,1.0305819756869246,0.24422287627277195,1,0,1,0,0.99239374255398027,0.13192659893527445,15.376763331631141,-86.419021946032871,93.580978053967129,null,1000000000,732879648.0625,null,30.935810965756829,-27.691252720286926,null,42.411799550698774,-58.727769225745952,null,0,0]
[27228.5,27.2285,12.153171496828062,1.4884201446736187,1.2096140127118622,0.59756157242734231,1,0,8982.4926837375078,1.5706849991225817,4.2439354244317844,1.3329291939260639,1.0309318213841461,0.24558094546494871,1,0,1,0,0.9923066213770787,0.13270669723242265,15.337783819705169,-86.339125992426105,93.660874007573895,null,1000000000,741391212.25,null,30.930063398470729,-27.693155928113075,null,42.378567606058901,-58.645970064313012,null,0,0]
[27385.25,27.385249999999999,12.222662964544696,1.4888895443837398,1.2118226567424655,0.60023437472524088,1,0,9034.2034173723096,1.570685636349282,4.2670142458412084,1.3342403544487633,1.0312835671903808,0.24693809074984935,1,0,1,0,0.99221902561238606,0.13348707801813015,15.299155178472017,-86.260264092118874,93.739735907881126,null,1000000000,749951917.5625,null,30.924347002936756,-27.69582717131269,null,42.345655360359721,-58.564436920806145,null,0,0]
[27542,27.542000000000002,12.292157094904899,1.4893536366605391,1.2140399263442565,0.60289743301070098,1,0,9085.9141510107365,1.5706862663226757,4.2901003239218403,1.3355374058310456,1.0316372111620524,0.2482943080757854,1,0,1,0,0.99213095575803445,0.13426774296183364,15.260872707550456,-86.182427480607871,93.817572519392129,null,1000000000,758561764,null,30.91866081037049,-27.699253224995534,null,42.313059082004415,-58.483174255612312,null,0,0]
[27702.5,27.702500000000001,12.363316476328645,1.4898234254821392,1.2163191289742386,0.60561412067649656,1,0,9138.8619835437294,1.5706869039801308,4.3137460979910642,1.3368510997348872,1.0320012803022807,0.24968200505626087,1,0,1,0,0.99204028825475477,0.13506738028108883,15.222028258050218,-86.103782102330271,93.896217897669729,null,1000000000,767428506.25,null,30.912868896302115,-27.703529824043482,null,42.280006546572565,-58.400252278286821,null,0,0]
[27863,27.863,12.434478555124777,1.4902878372358046,1.2186072748978243,0.60832062615309068,1,0,9191.8098160803947,1.5706875342913547,4.3373992355096487,1.3381504679279514,1.0323673353664651,0.25106872061106666,1,0,1,0,0.99194912477365338,0.13586731906172511,15.183537031690943,-86.026193459996648,93.973806540003352,null,1000000000,776346769,null,30.907106677210365,-27.708570573401541,null,42.247277539305045,-58.317622886595124,null,0,0]
[28023.5,28.023499999999999,12.505643285245934,1.4907469635158574,1.2209043138320552,0.61101696714920983,1,0,9244.7576486206726,1.5706881573825704,4.3610596166658802,1.339435739153602,1.0327353742428615,0.2524544504534012,1,0,1,0,0.99185746585951962,0.13666756109818828,15.145394247533037,-85.949652545340939,94.050347454659061,null,1000000000,785316552.25,null,30.901373197798854,-27.714362128656784,null,42.214868234558637,-58.235290416684172,null,0,0]
[28184,28.184000000000001,12.576810621685278,1.4912008938524608,1.2232101956769779,0.61370316183200502,1,0,9297.7054811644957,1.5706887733771255,4.3847271241978012,1.3407071374050097,1.0331053948112989,0.25383919031769742,1,0,1,0,0.99176531206053897,0.13746810818570709,15.107595209766266,-85.874150478826607,94.125849521173393,null,1000000000,794337856,null,30.895667529543786,-27.720891418614173,null,42.182774865046952,-58.153259060212427,null,0,0]
[28348,28.347999999999999,12.649532540231711,1.4916594468952777,1.2255754438836568,0.61643747272642269,1,0,9351.8079393437201,1.570689395599518,4.408917987368544,1.3419921590022696,1.033485529134321,0.25525309998970397,1,0,1,0,0.99167063806073996,0.13828642965692256,15.069322167225771,-85.798065918664321,94.201934081335679,null,1000000000,803609104,null,30.889865227121852,-27.728311812052215,null,42.150304124928375,-58.069754106612116,null,0,0]
[28512,28.512,12.722257088198539,1.4921127575566588,1.2279498197124639,0.61916122973863907,1,0,9405.9103975265225,1.5706900106639088,4.4331160514369268,1.3432631541563878,1.0338677280184527,0.25666596709989797,1,0,1,0,0.99157544852504753,0.13910507342081166,15.031398377223859,-85.723047662568533,94.276952337431467,null,1000000000,812934144,null,30.884090083845589,-27.736475716969668,null,42.118155478202731,-57.986571945598882,null,0,0]
[28676,28.675999999999998,12.794984220750207,1.4925609150423271,1.2303332703181935,0.62187445367393368,1,0,9460.0128557128428,1.5706906186931091,4.4573211991254835,1.3445203472358003,1.034251989174872,0.25807778716651503,1,0,1,0,0.99147974404931372,0.13992404139518202,14.993819092492354,-85.649086634364252,94.350913365635748,null,1000000000,822312976,null,30.87834119031827,-27.745370028252477,null,42.086325086998542,-57.903716606111729,null,0,0]
[28840,28.84,12.867713894063208,1.4930040065495924,1.2327257430631469,0.62457716579730727,1,0,9514.115313902621,1.570691219807137,4.4815333156564847,1.3457639579368692,1.0346383103058161,0.2594885557311265,1,0,1,0,0.99138352523311135,0.14074333549870868,14.95657965005039,-85.576173885379404,94.423826114620596,null,1000000000,831745600,null,30.872617662783377,-27.754981909653687,null,42.054809172091474,-57.821191975725718,null,0,0]
[29008,29.007999999999999,12.942220051544135,1.493452741436391,1.2351858689002644,0.62733492091311305,1,0,9569.5373442468917,1.570691828534861,4.5063430800692572,1.3470240421348258,1.0350361874443204,0.26093263836490399,1,0,1,0,0.99128442693638463,0.14158295254949466,14.918779517420154,-85.502560496119102,94.497439503880898,null,1000000000,841464064,null,30.866779940879418,-27.765559121004767,null,42.022846761365201,-57.737001375114332,null,0,0]
[29176,29.175999999999998,13.016728785275182,1.4938963392272373,1.2376553512028743,0.63008169180272777,1,0,9624.9593745946695,1.5706924302522849,4.5311599213469167,1.3482703255101962,1.0354362213596258,0.26237560818238981,1,0,1,0,0.99118479018912931,0.14242291591091785,14.881326363736591,-85.430028532433411,94.569971467566589,null,1000000000,851238976,null,30.860967039006624,-27.77686289990719,null,41.991206509554424,-57.653165632526189,null,0,0]
[29344,29.344000000000001,13.091240051268205,1.4943348874622988,1.2401341340763161,0.63281750276119941,1,0,9680.3814049458906,1.5706930250798146,4.5559837238445597,1.3495030297456183,1.0358384095529336,0.26381746046737109,1,0,1,0,0.99108461564804751,0.14326322764834945,14.844215438719266,-85.358568771537875,94.641431228462125,null,1000000000,861070336,null,30.855178085605417,-27.788880281561045,null,41.959884537938308,-57.569688489976812,null,0,0]
[29512,29.512,13.165753806529375,1.4947684717078213,1.2426221618622511,0.63554237854633699,1,0,9735.8034353004987,1.5706936131351146,4.5808143743919523,1.3507223718842436,1.0362427495158788,0.26525819052952337,1,0,1,0,0.99098390397396163,0.14410388982813005,14.807442076436452,-85.288172118241235,94.711827881758765,null,1000000000,870958144,null,30.849412233913782,-27.801598568315658,null,41.928877027347127,-57.486573549925573,null,0,0]
[29684,29.684000000000001,13.242044233816749,1.4952073240406283,1.2451789482439579,0.63832082983895055,1,0,9792.545037809854,1.5706942082957855,4.6062432098250419,1.3519571247689046,1.0366589432200037,0.26673205619759865,1,0,1,0,0.99088023862867691,0.14496493299031182,14.770138086389018,-85.217191364693463,94.782808635306537,null,1000000000,881139856,null,30.843532174365333,-27.815332821843192,null,41.897453096848139,-57.401858542850263,null,0,0]
[29856,29.856000000000002,13.318337182189858,1.4956411486005485,1.2477453077099248,0.64108787299601078,1,0,9849.2866403226399,1.5706947965990321,4.6316789908854377,1.3531783177191532,1.0370773870273242,0.26820473570109404,1,0,1,0,0.9907760116832055,0.14582634786775533,14.733178289278602,-85.147306048601777,94.852693951398223,null,1000000000,891380736,null,30.837674609698745,-27.829775647258131,null,41.866350864404318,-57.317530401343639,null,0,0]
[30028,30.027999999999999,13.394632608570012,1.4960700311370072,1.2503211813121577,0.64384353602360767,1,0,9906.0282428387945,1.5706953781626916,4.6571216037684318,1.3543861693028514,1.0374980782153052,0.26967622409125008,1,0,1,0,0.99067122386016271,0.14668813668112249,14.696557939909361,-85.078506805842636,94.921493194157364,null,1000000000,901680784,null,30.831838706924877,-27.844914244752967,null,41.835566417808948,-57.233592561089665,null,0,0]
[30200,30.2,13.470930470853084,1.4964940554640962,1.2529065103697941,0.6465878473892821,1,0,9962.7698453582598,1.5706959531019176,4.6825709371124971,1.3555808934939095,1.037921014051215,0.2711465164479418,1,0,1,0,0.99056587588671619,0.1475503016521566,14.66027237734451,-85.010784399729744,94.989215600270256,null,1000000000,912040000,null,30.826023656972996,-27.860736079221144,null,41.805095905195977,-57.150048320508617,null,0,0]
[30375.75,30.37575,13.548894277298793,1.4969223914997483,1.2555579117691849,0.64938029561560295,1,0,10020.748546773231,1.5706965338505878,4.7085819535711178,1.3567883235733917,1.0383554866073041,0.27264762407596871,1,0,1,0,0.99045765324139423,0.14843165468607442,14.623536756814353,-84.942688316452859,95.057311683547141,null,1000000000,922686188.0625,null,30.820102547568489,-27.877595837757536,null,41.774281394070329,-57.065092478695334,null,0,0]
[30551.5,30.551500000000001,13.626860541139077,1.4973458261516988,1.2582190624097569,0.65216095331571033,1,0,10078.727248191541,1.5706971079176499,4.7345997591807327,1.3579824851195266,1.0387922969545813,0.27414747265500433,1,0,1,0,0.99034884730380091,0.14931340515208624,14.587141102289857,-84.875697433089044,95.124302566910956,null,1000000000,933394152.25,null,30.814201575419311,-27.895143306234495,null,41.743786711695002,-56.980554126854557,null,0,0]
[30727.25,30.727250000000002,13.70482922043386,1.4977644429207562,1.260889900563205,0.65492985227807121,1,0,10136.705949613135,1.5706976754177537,4.7606242426289587,1.3591635923000451,1.0392314421451816,0.27564605702897521,1,0,1,0,0.99023945886447984,0.15019555542396859,14.551080701298378,-84.809802288785193,95.190197711214807,null,1000000000,944163892.5625,null,30.80831994988699,-27.913365924892606,null,41.713607936235846,-56.896436363892569,null,0,0]
[30903,30.902999999999999,13.782800274190787,1.498178323425073,1.2635703647993648,0.65768702474409013,1,0,10194.684651037955,1.5706982364629409,4.786655294995918,1.3603318547713725,1.0396729192204766,0.27714337207320855,1,0,1,0,0.99012948871896589,0.15107810787669368,14.515350924928086,-84.744993549065484,95.255006450934516,null,1000000000,954995409,null,30.802456903217688,-27.932251394100966,null,41.683741206534854,-56.812742154964532,null,0,0]
[31083,31.082999999999998,13.862659249378899,1.498597386331924,1.2663255624182139,0.66049875023779592,1,0,10254.065397877477,1.5706988044988333,4.8133225300209999,1.3615152683277183,1.0401274861767931,0.27867557423961692,1,0,1,0,0.99001625712689978,0.15198242165032949,14.479095091384668,-84.679734104908249,95.320265895091751,null,1000000000,966152889,null,30.796470555153142,-27.952268055481902,null,41.653471721055986,-56.727466049426347,null,0,0]
[31263,31.263000000000002,13.942520631151915,1.4990116486089107,1.2690907278387953,0.66329824509598467,1,0,10313.446144720267,1.5706993659936732,4.8399964316615245,1.3626856395907245,1.0405844928448922,0.28020643416406094,1,0,1,0,0.98990241705995463,0.15288716233768329,14.443176498106389,-84.615594817861378,95.384405182138622,null,1000000000,977375169,null,30.790502135658713,-27.972954705652789,null,41.623521547272148,-56.642640112208582,null,0,0]
[31443,31.443000000000001,14.022384378391324,1.499421192137818,1.271865796048071,0.66608554535324815,1,0,10372.826891566272,1.5706999210597963,4.866676890299793,1.3638431798317669,1.0410439360117554,0.28173594644373123,1,0,1,0,0.98978796938911495,0.15379233249415059,14.407590432234006,-84.552566053108933,95.447433946891067,null,1000000000,988662249,null,30.784550889864327,-27.994298936533635,null,41.593886727194132,-56.558267116575301,null,0,0]
[31623,31.623000000000001,14.102250450908862,1.4998260969519415,1.2746507023673486,0.6688606874888583,1,0,10432.207638415437,1.5707004698069809,4.8933637986821568,1.3649880958526273,1.0415058124529184,0.28326410571054783,1,0,1,0,0.98967291499088961,0.15469793467646095,14.372332264598104,-84.490638302454684,95.509361697545316,null,1000000000,1000014129,null,30.778616084994464,-28.016288597976651,null,41.564563364428096,-56.474349704478051,null,0,0]
[31807,31.806999999999999,14.183893687500467,1.5002352866194768,1.2775075969755822,0.67168497149063688,1,0,10492.907957420015,1.5707010243291195,4.9206503065340117,1.3661456170785513,1.0419804644299406,0.28482482007178822,1,0,1,0,0.98955467764526539,0.1556241105486503,14.336624756798528,-84.42846259522932,95.57153740477068,null,1000000000,1011685249,null,30.77256564798148,-28.039421634763546,null,41.534906293641505,-56.389040960465771,null,0,0]
[31991,31.991,14.265539271805281,1.5006397925452535,1.2803746362037862,0.67449662945547295,1,0,10553.608276427782,1.5707015724724598,4.9479433346239574,1.3672903699692638,1.042457652178638,0.28638410938604386,1,0,1,0,0.98943580817682553,0.15655074326807969,14.301250359853837,-84.367417680480614,95.632582319519386,null,1000000000,1023424081,null,30.76653090991346,-28.063204228614154,null,41.505566634764847,-56.304213451866467,null,0,0]
[32175,32.174999999999997,14.347187163742895,1.5010396945593667,1.2832517520566757,0.67729570170465891,1,0,10614.308595438684,1.5707021143464373,4.9752427756464535,1.3684225616812564,1.0429373722183435,0.28794196803213412,1,0,1,0,0.98931630753977884,0.15747783557009412,14.266204387847502,-84.307493793627572,95.692506206372428,null,1000000000,1035230625,null,30.760511155132274,-28.087624194536073,null,41.476540417539681,-56.219869599091503,null,0,0]
[32359,32.359000000000002,14.428837324138971,1.5014350706909028,1.2861388769094797,0.68008222898817983,1,0,10675.008914452666,1.5707026500579986,5.0025485246133297,1.3695423949784893,1.0434196210563373,0.28949839042696579,1,0,1,0,0.98919617669440563,0.1584053901915142,14.231482238085722,-84.248681296134365,95.751318703865635,null,1000000000,1047104881,null,30.754505689142913,-28.112669601250019,null,41.447823733767272,-56.136011694884331,null,0,0]
[32547.5,32.547499999999999,14.512486675784414,1.5018355028137553,1.2891069196586504,0.68292393914789551,1,0,10737.193752141329,1.570703192590138,5.0305285110736717,1.3706770075040469,1.0439162826825108,0.29109138233390613,1,0,1,0,0.98907245536085664,0.15935611185318374,14.196241977437552,-84.189572995412789,95.810427004587211,null,1000000000,1059339756.25,null,30.748367463079962,-28.138963890050956,null,41.418721699182051,-56.050609105361829,null,0,0]
[32736,32.735999999999997,14.59613832777524,1.5022313451815605,1.29208532448019,0.68575257112668297,1,0,10799.378589833115,1.5707037288742745,5.0585149019165812,1.3717990669027031,1.0444155908514838,0.29268285513946835,1,0,1,0,0.98894807467650436,0.16030732454389426,14.161332052114826,-84.131611024671216,95.868388975328784,null,1000000000,1071645696,null,30.742242822852447,-28.165890023961936,null,41.389936414086833,-55.965721000709273,null,0,0]
[32924.5,32.924500000000002,14.679792240786435,1.5026226761344006,1.2950740198821722,0.68856817004715887,1,0,10861.56342752797,1.570704259017722,5.0865075914297089,1.3729087775772024,1.0449175417693484,0.29427280296541475,1,0,1,0,0.98882303569370711,0.16125903121106563,14.126747772771061,-84.074785413940774,95.925214586059226,null,1000000000,1084022700.25,null,30.736131086474753,-28.193435960918791,null,41.361463871120769,-55.881349453021954,null,0,0]
[33113,33.113,14.763448376383236,1.5030095722423213,1.29807293478521,0.69137078144366648,1,0,10923.748265225844,1.5707047831253504,5.1145064761915124,1.3740063395775273,1.0454221316294214,0.2958612199756076,1,0,1,0,0.9886973394715548,0.16221123480376354,14.092484533584283,-84.019086320008057,95.980913679991943,null,1000000000,1096470769,null,30.73003159240406,-28.221589910524376,null,41.33330012600468,-55.797496409483664,null,0,0]
[33305.75,33.305750000000003,14.848992917454208,1.5034006834869806,1.3011499585781772,0.69422319948866174,1,0,10987.335148339072,1.5707053129150177,5.1431429364743444,1.3751162890252406,1.0459408230657217,0.29748386108874181,1,0,1,0,0.98856813072617367,0.16318542410959619,14.057776047208023,-83.963286187201291,96.036713812798709,null,1000000000,1109272983.0625,null,30.723806567531717,-28.250995333890085,null,41.30481666450077,-55.712290853311202,null,0,0]
[33498.5,33.4985,14.934539703924568,1.503787314128505,1.3042375189001725,0.69706213531276817,1,0,11050.922031455346,1.570705836607877,5.1717856628731225,1.3762139454214932,1.0464622656924873,0.29910488937184065,1,0,1,0,0.98843823703187383,0.16416013924324913,14.023393759644154,-83.908643519107358,96.091356480892642,null,1000000000,1122149502.25,null,30.717593006824359,-28.281012339547072,null,41.276647937644249,-55.627631179560296,null,0,0]
[33691.25,33.691249999999997,15.020088697428356,1.5041695406099909,1.3073355410982079,0.69988763884034522,1,0,11114.508914574619,1.5707063543085695,5.200434551851127,1.3772995092642708,1.046986455399098,0.30072429872180062,1,0,1,0,0.98830765954291611,0.16513538336316239,13.989333005129257,-83.855148184728279,96.144851815271721,null,1000000000,1135100326.5625,null,30.711390265076322,-28.311629096120363,null,41.2487899248774,-55.543519088607944,null,0,0]
[33884,33.884,15.105639860467759,1.5045474376480004,1.3104439509734822,0.70269976038234416,1,0,11178.095797696835,1.5707068661193548,5.2290895021186135,1.3783731767721419,1.0475133880615271,0.30234208308166738,1,0,1,0,0.98817639942096991,0.16611115962959669,13.955589201140437,-83.802790179797469,96.197209820202531,null,1000000000,1148125456,null,30.705197716676022,-28.342834019935225,null,41.221238669288873,-55.459956159862266,null,0,0]
[34081.5,34.081499999999998,15.193301500289509,1.5049302329001215,1.3136396600830098,0.70556735422773553,1,0,11243.249672753731,1.5707073845379491,5.2584567890640912,1.3794611641361363,1.0480561469495635,0.30399804318283696,1,0,1,0,0.98804119776267729,0.16711153754894631,13.921337893850403,-83.750311284016021,96.249688715983979,null,1000000000,1161548642.25,null,30.698862502251941,-28.375406163888538,null,41.193322576422922,-55.374905120127458,null,0,0]
[34279,34.279000000000003,15.280965340875913,1.5053086361676264,1.3168461188946194,0.70842100652975271,1,0,11308.403547813614,1.5707078969827595,5.2878302313885079,1.3805370654093905,1.0486017768414513,0.30565228449039133,1,0,1,0,0.98790528190537397,0.1681124808892249,13.88740986993367,-83.699005593979408,96.300994406020592,null,1000000000,1175049841,null,30.692536720286455,-28.408571967940158,null,41.165720334471672,-55.290433626039245,null,0,0]
[34476.5,34.476500000000001,15.368631344566989,1.5056827224997067,1.3200632490746189,0.711260772573728,1,0,11373.557422876431,1.5707084035564491,5.3172097270808409,1.3816010784201813,1.0491502732578359,0.30730480063937748,1,0,1,0,0.98776865312303852,0.16911399305611727,13.853800459366475,-83.648862743676659,96.351137256323341,null,1000000000,1188629052.25,null,30.686219757709171,-28.442319738561949,null,41.138427886481765,-55.206543005114696,null,0,0]
[34674,34.673999999999999,15.456299474556237,1.5060525652477341,1.3232909727916451,0.71408670800412699,1,0,11438.711297942133,1.5707089043593419,5.3465951763514736,1.3826533967566672,1.0497016317052157,0.30895558531579953,1,0,1,0,0.98763131269787452,0.17011607745733706,13.820505075798087,-83.599872495084711,96.400127504915289,null,1000000000,1202286276,null,30.679911020378718,-28.476638027952266,null,41.111441240243835,-55.123234467132441,null,0,0]
[34875.75,34.875749999999996,15.545856291940607,1.5064260596483878,1.3265990113747959,0.71695923268029649,1,0,11505.267218423571,1.5707094100825532,5.3766190163493164,1.383716482049232,1.0502678052162235,0.31064009893128003,1,0,1,0,0.98749028340949208,0.17114032008363927,13.786812761381666,-83.551007583029474,96.448992416970526,null,1000000000,1216317938.0625,null,30.673474419348263,-28.512272223971561,null,41.084185526857866,-55.038735359057924,null,0,0]
[35077.5,35.077500000000001,15.635415253098822,1.5067952753815212,1.3299179417462124,0.7198174435531699,1,0,11571.823138907917,1.5707099099883794,5.4066488652450051,1.3847677592479719,1.0508369557362567,0.3123227925968779,1,0,1,0,0.98734851425213865,0.17216516703198034,13.753438718661098,-83.503324212186158,96.496675787813842,null,1000000000,1230431006.25,null,30.667045205848765,-28.548478365172954,null,41.057240697636786,-54.954845847013196,null,0,0]
[35279.25,35.279249999999998,15.724976321402369,1.5071602854526174,1.3332476825652266,0.72266140099369369,1,0,11638.379059395122,1.5707104041766242,5.4366846234670332,1.3858074217163305,1.0514090784307564,0.31400365974693789,1,0,1,0,0.98720600661927116,0.1731906219414254,13.720378317108953,-83.456811865588136,96.543188134411864,null,1000000000,1244625480.5625,null,30.660622803833739,-28.5852450021812,null,41.030602698099671,-54.871566863406947,null,0,0]
[35481,35.481000000000002,{"$f":"SQRT(1+(A397/pole1)^2)","v":15.814539461051627},{"$f":"ATAN(A397/pole1)","v":1.5075211612178809},{"$f":"SQRT(1+(A397/Zero1)^2)","v":1.336588153038093},{"$f":"ATAN(A397/Zero1)","v":0.72549116569447836},{"$f":"IF(VIN_nom>Vout, 1, SQRT(1+(A397/z_RHP)^2))","v":1},{"$f":"IF(VIN_nom>Vout, 0, -ATAN(A397/z_RHP))","v":0},{"$f":"SQRT(1+(A397/Pole2)^2)","v":11704.934979885138},{"$f":"ATAN(A397/Pole2)","v":1.5707108927448199},5.4667261936128133,1.3868356586690467,{"$f":"SQRT(1+(A397/pole4)^2)","v":1.0519841684504623},{"$f":"ATAN(A397/pole4)","v":0.3156826938713343},{"$f":"IF(VOUT_setting=1,1,SQRT(1+(A397*zterm1)^2))","v":1},{"$f":"IF(VOUT_setting=1,0,ATAN(((A397*zterm1))))","v":0},1,{"$f":"IF(VOUT_setting=1,0,ATAN(A397*$Q$4/(1+Afbr-$Q$5*(A397)^2)))","v":0},{"$f":"SQRT((1-(Z397/pterm2))^2+(A397/pterm1)^2)","v":0.98706276191336961},{"$f":"IF((ATAN((A397/pterm1)/(1-A397^2/pterm2))>0),ATAN((A397/pterm1)/(1-A397^2/pterm2)),PI()+ATAN((A397/pterm1)/(1-A397^2/pterm2)))","v":0.17421668845327121},{"$f":"20*LOG10(((E397*K397*G397*O397)/(C397*I397*S397*M397*Q397))*Adc)","v":13.687627009317531},{"$f":"((F397+L397+H397+P397)-(D397+J397+T397+N397+R397))*radconv","v":-83.411460154224841},{"$f":"IF(V397>0,V397,V397+180)","v":96.588539845775159},null,{"$f":"IF(U397<0,A397,1000000000)","v":1000000000},{"$f":"A397^2","v":1258901361},null,{"$f":"20*LOG10((K397/(I397*M397))*AEA)","v":30.654206655316393},{"$f":"(L397-(J397+N397))*radconv","v":-28.622560926375787},null,{"$f":"20*LOG10((E397*G397/(C397*S397))*Acs*Am)","v":41.004267538825594},{"$f":"(F397+H397-(D397+T397))*radconv","v":-54.788899227849051},null,{"$f":"SUM((U398<0)*(U397>0))*A397","v":0},0]
[35687.75,{"$f":"A398/1000","v":35.687750000000001},15.906324369580805,1.507886764308626,1.3400224587649521,0.72837639997016024,1,0,11773.140365569841,1.5707113876902778,5.4975182185197502,1.3878777184824755,1.052576584469026,0.31740143126373305,1,0,1,0,0.98691520392950582,0.1752688224604998,13.654380028870612,-83.366177887094963,96.633822112905037,null,1000000000,1273615500.0625,null,30.647637417039956,-28.661360054072045,null,40.97758979665511,-54.704817833022943,null,0,0]
[35894.5,35.894500000000001,15.998111379842332,1.5082481722501921,1.3434678625260614,0.73124685932726552,1,0,11841.345751257393,1.5707118769340283,5.5283161466147188,1.3889081688951255,1.0531721063566672,0.31911822998410083,1,0,{"$f":"IF(VOUT_setting=1,1,SQRT((1+Afbr-$Q$5*(A399)^2)^2+(A399*$Q$4)^2))","v":1},0,0.98676687489726111,0.17632160651066156,13.621448242731871,-83.322092806076071,96.677907193923929,null,1000000000,1288415130.25,null,30.641073615216396,-28.700712947027249,null,40.951221812339931,-54.621379859048837,null,0,0]
[36101.25,36.10125,16.089900455867355,1.5086054567443519,1.346924279155814,0.73410261002611632,1,0,11909.551136947748,1.570712360574031,5.5591198797854506,1.389927200687429,1.0537707288476872,0.3208330832076961,1,0,1,0,0.98661777635559977,0.1773750445298754,13.588827016496232,-83.279194131560502,96.720805868439498,null,1000000000,1303300251.5625,null,30.634514704595755,-28.740608288911567,null,40.92515949672493,-54.538585842648935,null,0,0]
[36308,36.308,16.181691562502355,1.5089586878702226,1.3503916240897169,0.73694371860936947,1,0,11977.756522640857,1.5707128387060152,5.5899293220640009,1.390935000529852,1.0543724466609612,0.32254598417100516,1,0,1,0,0.98646790985351329,0.17842914044674421,13.556511799417862,-83.237471213799097,96.762528786200903,null,1000000000,1318270864,null,30.627960157374737,-28.781035002259223,null,40.899398826867582,-54.456436211539867,null,0,0]
[36519.5,36.519500000000001,16.275593599042161,1.5093159116319674,1.3539498501677225,0.73983501962906684,1,0,12047.528900269257,1.5707133222211433,5.6214524086593105,1.3919545226256398,1.054991185992074,0.32429621131887454,1,0,1,0,0.98631380722454343,0.17950813864552026,13.523766129414398,-83.195995343732378,96.804004656267622,null,1000000000,1333673880.25,null,30.6212590043124,-28.822929021236426,null,40.873354309926462,-54.373066322495923,null,0,0]
[36731,36.731000000000002,16.369497688663063,1.5096690369897816,1.3575193353646751,0.74271113971150959,1,0,12117.301277900442,1.5707138001680347,5.6529812731646851,1.392962673220953,1.0556131532781852,0.32604438134893454,1,0,1,0,0.98615890425403807,0.18058783364391037,13.491331317045871,-83.155727735508847,96.844272264491153,null,1000000000,1349166361,null,30.614561353566319,-28.865356395993253,null,40.84761714830401,-54.290371339515588,null,0,0]
[36942.5,36.942500000000003,16.463403796233926,1.510018133985866,1.361099991099447,0.74557215089650264,1,0,12187.073655534361,1.5707142726423258,5.6845158194395156,1.393959639497615,1.0562383428169386,0.3277904872195026,1,0,1,0,0.98600320263292673,0.18166822965566304,13.459202750299502,-83.116657393396693,96.883342606603307,null,1000000000,1364748306.25,null,30.607866693156105,-28.908306003822098,null,40.822183241967863,-54.208351389574567,null,0,0]
[37154,37.154000000000003,16.557311887419861,1.5103632710773673,1.3646917294448209,0.74841812545835795,1,0,12256.84603317097,1.5707147397374757,5.7160559534476221,1.3949456045961648,1.0568667488899632,0.32953452195586191,1,0,1,0,0.9858467040632084,0.18274933089726914,13.427375900790889,-83.078773452828514,96.921226547171486,null,1000000000,1380419716,null,30.601174527830487,-28.951766957275979,null,40.797048557784862,-54.127006495552543,null,0,0]
[37370.25,37.370249999999999,16.653331041554733,1.5107121348673445,1.3683755011559746,0.75131254525197233,1,0,12328.185402743053,1.5707152118563694,5.7483101171897841,1.3959425252126931,1.0575125878323755,0.33131557669695028,1,0,1,0,0.98568586853760343,0.1838554457509671,13.395141589943304,-83.041254176366181,96.958745823633819,null,1000000000,1396535585.0625,null,30.594334146472356,-28.996721583656864,null,40.771654628295408,-54.044532592709324,null,0,0]
[37586.5,37.586500000000001,16.74935219926062,1.5110569987465852,1.3720706750475207,0.75419139891932252,1,0,12399.524772317849,1.5707156785426897,{"$f":"SQRT(1+(A407/Zero2)^2)","v":5.780569930136922},{"$f":"ATAN(A407/Zero2)","v":1.3969283197058211},1.0581617772685852,0.33309445169679536,1,0,1,0,0.98552420349875536,0.18496230679103529,13.363213385901973,-83.004952627245643,96.995047372754357,null,1000000000,1412744982.25,null,30.587495377606643,-29.042188488714309,null,40.746565193119793,-53.962764138531334,null,0,0]
[37802.75,37.802750000000003,16.845375326275565,1.5113979310340204,1.375777159244759,0.75705476435968588,1,0,12470.864141895316,1.5707161398896674,5.8128352982339226,1.3979031714171326,1.0588143110357413,0.3348711397170378,1,0,1,0,0.9853617108019741,0.18606991853340785,13.33158670740594,-82.96985760121278,97.03014239878722,null,1000000000,1429047907.5625,null,30.580657742624318,-29.088156758363649,null,40.721776149606086,-53.881700842849121,null,0,0]
[38019,38.018999999999998,16.941400389113682,1.5117349985033379,1.3794948625806931,0.75990271965231215,1,0,12542.203511475404,1.5707165959884124,5.8451061294864148,1.3988672597235401,1.0594701829544657,0.33664563359233257,1,0,1,0,0.98519839231476714,0.18717828549703716,13.300257056645959,-82.935958026559604,97.064041973440396,null,1000000000,1445444361,null,30.57382077892089,-29.134615709741009,null,40.697283462549535,-53.801342316818605,null,0,0]
[38240.5,38.240499999999997,17.039758668937715,1.5120763106208441,1.3833143587646366,0.7628039219589059,1,0,12615.274819510401,1.5707170578122265,5.8781659841229166,1.3998437785126761,1.0601454319981334,0.33846092556001683,1,0,1,0,0.98503025472873196,0.18831434846360881,13.268470118643155,-82.902463359570362,97.097536640429638,null,1000000000,1462335840.25,null,30.566818059856807,-29.182700333450963,null,40.672499243610801,-53.719763026119388,null,0,{"$f":"IF(AH410>0,W410,0)","v":0}]
[38462,38.462000000000003,17.13811891100584,1.5124137050144641,1.3871454340940979,0.76568912311887438,1,0,12688.346127548059,1.5707175143168177,5.911231381412084,1.4008093735928657,1.0608241700689258,0.3402739005700966,1,0,1,0,0.98486125477484543,0.1894512133731564,13.236985513679997,-82.870199795413654,97.129800204586346,null,1000000000,1479325444,null,30.559815111828286,-29.231277782919669,null,40.648017586676175,-53.638922012493985,null,0,0]
[38683.5,38.683500000000002,17.236481081725323,1.5127472486776865,1.3909879928948279,0.76855840750663973,1,0,12761.417435588332,1.570717965593559,5.9443022288602991,1.4017642254689584,1.0615063904740836,0.34208455116043951,1,0,1,0,0.98469139449993093,0.19058888509169222,13.205798668566404,-82.839155852557838,97.160844147442162,null,1000000000,1496413172.25,null,30.552811486574907,-29.280337293667664,null,40.623834366815956,-53.558818558890181,null,0,0]
[38905,38.905000000000001,17.334845148265245,1.5130770070868926,1.3948419402616385,0.7714118596166023,1,0,12834.488743631173,1.5707184117317425,5.9773784360058064,1.402708510729815,1.062192086503748,0.34389286994899898,1,0,1,0,0.98452067596435433,0.19172736848857019,13.174905093994411,-82.809320184703637,97.190679815296363,null,1000000000,1513599025,null,30.545806751250844,-29.329868330054428,null,40.599945527568025,-53.479451854649234,null,0,0]
[39131.5,39.131500000000003,17.435431549692964,1.5134103615401044,1.3987945631895264,0.77431343948546894,1,0,12909.209516869463,1.570718862717821,6.0112067347577902,1.4036633645857624,1.0628968481853145,0.3457395896164801,1,0,1,0,0.9843452183580641,0.19289239573039774,13.143612831472799,-82.780048837981269,97.219951162018731,null,1000000000,1531274292.25,null,30.538642312188532,-29.380994316604657,null,40.575817704108729,-53.399054521376598,null,0,0]
[39358,39.357999999999997,17.536019866409092,1.513739891722409,1.4027588963755402,0.77719864323691079,1,0,12983.930290110351,1.570719308513171,6.0450404528595145,1.4046075307784085,1.0636052299311523,0.34758385566428385,1,0,1,0,0.98416886770708711,0.19405828201777267,13.112617995057516,-82.752017357316205,97.247982642683795,null,1000000000,1549052164,null,30.531475844118631,-29.432591781696562,null,40.551989335763345,-53.319425575619661,null,0,0]
[39584.5,39.584499999999998,17.636610065642767,1.5140656629966722,1.406734840817305,0.78006756148722878,1,0,13058.651063353791,1.5707197492068956,6.0788794998222242,1.4055411860939091,1.0643172245130004,0.34942566045829976,1,0,1,0,0.98399162625861614,0.19522503256816792,13.081916044563091,-82.725214033334836,97.274785966665164,null,1000000000,1566932640.25,null,30.524306930992427,-29.484650163932457,null,40.528456298395128,-53.240563869402365,null,0,0]
[39811,39.811,17.737202115365921,1.5143877392462379,1.4107222983402057,0.78292028490500687,1,0,13133.371836599736,1.5707201848860701,6.1127237871467912,1.406464503477403,1.0650328246851113,0.35126499645157261,1,0,1,0,0.98381349627478332,0.19639265260272623,13.051502523565997,-82.699627294059127,97.300372705940873,null,1000000000,1584915721,null,30.517135171502744,-29.537159126866158,null,40.505214536887721,-53.162468167192934,null,0,0]
[40042.75,40.042749999999998,17.840127651566224,1.5147135214768213,1.4148139953034882,0.78582246340830852,1,0,13209.824548300952,1.5707206255622801,6.147357878397715,1.4073986985830993,1.0657687359593477,0.35314440298044114,1,0,1,0,0.98363032015862051,0.19758824207564382,13.020678026262031,-82.674694766261339,97.325305233738661,null,1000000000,1603421827.5625,null,30.509793829463206,-29.591341001110358,null,40.481731381623277,-53.083353765150989,null,0,0]
[40274.5,40.274500000000003,17.943055059489133,1.5150355661480304,1.4189175399510128,0.78870787975344347,1,0,13286.277260004708,1.5707210611669578,6.1819972744581024,1.4083224253937709,1.0665084065058981,0.35502120922847791,1,0,1,0,0.98344621867870152,0.19878475287752317,12.990146305882588,-82.651011794695748,97.348988205304252,null,1000000000,1622035350.25,null,30.502448702778892,-29.645973388784075,null,40.458544787928155,-53.005038405911669,null,0,0]
[40506.25,40.506250000000001,18.045984307107876,1.5153539371464668,1.4230328297886587,0.79157663111087784,1,0,13362.729971710951,1.5707214917871513,6.2166418866520772,1.4092358573354373,1.0672518285085482,0.35689540739419551,1,0,1,0,0.98326119430692016,0.19998219061299716,12.959902849112403,-82.628566414875323,97.371433585124677,null,1000000000,1640756289.0625,null,30.495099406403238,-29.701045911303517,null,40.435650627533626,-52.927520503571813,null,0,0]
[40738,40.738,18.14891536312166,1.5156686969124262,1.427159763212819,0.7944288146291093,1,0,13439.182683419647,1.5707219175079274,6.2512916282563173,1.4101391640586349,1.0679989941332597,0.35876698977106253,1,0,1,0,0.98307524953169478,0.20118056089073294,12.929943226481473,-82.607346802582072,97.392653197417928,null,1000000000,1659584644,null,30.487745569415175,-29.756548411731199,null,40.413044841890752,-52.850798390850876,null,0,0]
[40975.25,40.975250000000003,18.254291068710138,1.5159872496167743,1.4313965951729175,0.79733162659706125,1,0,13517.44980684345,1.5707223483436945,6.2867689187294671,1.4110535932367159,1.0687677615907274,0.36068027183033924,1,0,1,0,0.98288394101528576,0.20240834331782004,12.899562067578339,-82.586881144337141,97.413118855662859,null,1000000000,1678971112.5625,null,30.480212131252099,-29.813803151314733,null,40.390197121150699,-52.773077993022412,null,0,0]
[41212.5,41.212499999999999,18.359668605404337,1.5163021456092853,1.4356454172853894,0.80021728089747513,1,0,13595.716930269729,1.5707227742190353,6.3222514070771716,1.4119577590282546,1.0695404357983631,0.36259079642839653,1,0,1,0,0.98269167322112305,0.20363711498401191,12.869469241440099,-82.567675486731176,97.432324513268824,null,1000000000,1698470156.25,null,30.472673191063777,-29.87148766452961,null,40.367643235200781,-52.696187822201573,null,0,0]
[41449.75,41.449750000000002,18.465047941854632,1.516613447433121,1.4399061234099351,0.80308588156924787,1,0,13673.98405369845,1.5707231952191274,6.3577390062715473,1.4128518318067729,1.0703170082951825,0.36449855560508077,1,0,1,0,0.98249844887310889,0.20486688192000058,12.839660256664324,-82.54971758488027,97.45028241511973,null,1000000000,1718081775.0625,null,30.465128393904067,-29.929591738489187,null,40.345379047584714,-52.620125846391076,null,0,0]
[41687,41.686999999999998,18.570429047422465,1.5169212162146177,1.4441786083636894,0.80593753254790979,1,0,13752.251177129565,1.5707236114272087,6.3932316312046167,1.4137359782277781,1.0710974706021135,0.36640354150378363,1,0,1,0,0.9823042707134706,0.2060976501609148,12.810130705953833,-82.53299533774711,97.46700466225289,null,1000000000,1737805969,null,30.457577398383961,-29.98810537915492,null,40.323400492394335,-52.544889958592208,null,0,0]
[41929.75,41.929749999999999,18.678254928972898,1.5172325252485723,1.4485622222066716,0.8088378559810262,1,0,13832.332712275955,1.5707240324088612,6.429552171755045,1.4146305170286433,1.0719000430730075,0.36834981080569695,1,0,1,0,0.98210460670231992,0.20735799312926498,12.780201307721903,-82.517151911751085,97.482848088248915,null,1000000000,1758103935.0625,null,30.449844595543766,-30.048389218590984,null,40.301203897002594,-52.468762693160109,null,0,0]
[42172.5,42.172499999999999,18.786082599915257,1.5175402606316144,1.4529579475901708,0.81172065447883412,1,0,13912.414247424771,1.5707244485440714,6.4658777994277834,1.4155150054024408,1.0727066697782619,0.3702931604474729,1,0,1,0,0.9819039500110357,0.20861939716282901,12.750555376167698,-82.502576915198816,97.497423084801184,null,1000000000,1778519756.25,null,30.442104622083924,-30.109081343196618,null,40.279297938908229,-52.393495572002195,null,0,0]
[42415.25,42.41525,18.893912029613325,1.5178444834904938,1.4573656749212314,0.81458603891895887,1,0,13992.495782575968,1.5707248599160504,6.5022084289627653,1.4163896104216882,1.0735173415789832,0.37223358234854254,1,0,1,0,0.98170230363687716,0.20988186874068812,12.721188451597891,-82.489257838034135,97.510742161965865,null,1000000000,1799053432.5625,null,30.434357153512298,-30.170171722206835,null,40.257678482910052,-52.319086115827311,null,0,0]
[42658,42.658000000000001,19.001743188125811,1.5181452535670663,1.4617852956312891,0.81743411998737869,1,0,14072.577317729507,1.5707252666061151,6.5385439769832594,1.4172544955063784,1.0743320493181008,0.37417106854085425,1,0,1,0,0.98149967059738774,0.21114541434678391,12.692096158492623,-82.477182317723873,97.522817682276127,null,1000000000,1819704964,null,30.426601878312276,-30.231650540469129,null,40.236341465004806,-52.245531777254719,null,0,0]
[42906.5,42.906500000000001,19.112130294914575,1.5184496324875754,1.4663218105628815,0.82033185563940314,1,0,14154.555737858167,1.5707256781627987,6.5757452117484858,1.4181299659179678,1.0751702258653393,0.37615139877510567,1,0,1,0,0.98129121897807869,0.21244000872189189,12.662594743225991,-82.466096101351667,97.533903898648333,null,1000000000,1840967742.25,null,30.418654506283104,-30.294977925794608,null,40.214787421767355,-52.171118175557076,null,0,0]
[43155,43.155000000000001,19.22251915203924,1.5187505155316552,1.4708705620013374,0.82321169252184501,1,0,14236.534157989199,1.5707260849797382,6.6129514297763272,1.4189955857295073,1.076012612337421,0.37812863603994396,1,0,1,0,0.98108173986234304,0.21373574237472259,12.633372106871676,-82.45628729792432,97.54371270207568,null,1000000000,1862354025,null,30.410698332594045,-30.358692223268168,null,40.193520959102088,-52.097595074656127,null,0,0]
[43403.5,43.403500000000001,19.332909729517109,1.5190479625285362,1.4754314367713013,0.82607374863268324,1,0,14318.512578122562,1.5707264871383431,6.650162547425964,1.4198515189904635,1.0768591988545477,0.38010277215220928,1,0,1,0,0.98087123655366226,0.2150326222767816,12.604423817477048,-82.447743110517578,97.552256889482422,null,1000000000,1883863812.25,null,30.402733062545163,-30.422783569351672,null,40.172537939756346,-52.024959541165913,null,0,0]
[43652,43.652000000000001,19.443301998045943,1.5193420319511546,1.4800043227927058,0.82891814168253974,1,0,14400.490998258212,1.5707268847181699,6.6873784829073157,1.4206979261559918,1.0777099755187836,0.38207379905107697,1,0,1,0,0.98065971237802274,0.21633065540489813,12.575745527479985,-82.440450894108807,97.559549105891193,null,1000000000,1905497104,null,30.394758413871081,-30.487242313348901,null,40.151834298433364,-51.95320858075992,null,0,0]
[43906,43.905999999999999,19.556139274013486,1.5196391789129278,1.4846907169838104,0.83180735754444335,1,0,14484.283830109451,1.5707272864465767,6.7254230068206926,1.4215533853762312,1.0785839022100125,0.38408522882527046,1,0,1,0,0.98044245505802763,0.21765861670007258,12.546707096247044,-82.434278114812571,97.565721885187429,null,1000000000,1927736836,null,30.386597290354519,-30.553497564749797,null,40.130956990716989,-51.880780550062788,null,0,0]
[44160,44.16,19.668978256904087,1.5199329164949289,1.4893894266787842,0.83467836751253177,1,0,14568.076661963003,1.5707276835536514,6.7634723970974973,1.4223992200645306,1.07946218561355,0.38609339359181122,1,0,1,0,0.98022413828048427,0.21898779759094106,12.517941825192034,-82.429387100128551,97.570612899871449,null,1000000000,1950105600,null,30.378425810117051,-30.620116925269656,null,40.110363199899446,-51.809270174858874,null,0,0]
[44414,44.414000000000001,19.781818917507984,1.5202233029900083,1.4941003356866851,0.83753129624338807,1,0,14651.869493818824,1.570728076118681,6.8015265720668765,1.4232355905465519,1.080344815103822,0.38809828513676314,1,0,1,0,0.98000476567042327,0.22031820554511747,12.489445332813876,-82.425764823492742,97.574235176507258,null,1000000000,1972603396,null,30.370243709354249,-30.687090742843633,null,40.090048808284081,-51.738674080649112,null,0,0]
[44668,44.667999999999999,19.894661227277677,1.520510395370761,1.4988233289775761,0.84036626800578496,1,0,14735.662325676876,1.570728464219149,6.8395854518654247,1.4240626536330669,1.0812317800374553,0.3900998953782,1,0,1,0,0.9797843408777015,0.22164984803599802,12.46121332168711,-82.423398414096141,97.576601585903859,null,1000000000,1995230224,null,30.362050736096723,-30.754409574255519,null,40.070009770414849,-51.668988839840623,null,0,0]
[44928.25,44.928249999999998,20.010281850044674,1.5208011935645245,1.5036749525432094,0.84325250226943249,1,0,14821.516989029775,1.5707288573178182,6.8785856180888407,1.4249005743197256,1.0821450555221326,0.39214734611919616,1,0,1,0,0.97955740475281861,0.22301554561811471,12.432556540978704,-82.422263079043404,97.577736920956596,null,1000000000,2018547648.0625,null,30.353644635545194,-30.823733064537176,null,40.049759090257965,-51.598530014506231,null,0,0]
[45188.5,45.188499999999998,20.125904145510596,1.5210886505407049,1.5085390216133729,0.84612014779146028,1,0,14907.37165238494,1.5707292458886128,6.9175905593853448,1.4257290463251224,1.0830628597563043,0.39419133533372697,1,0,1,0,0.97932937186541968,0.22438255514220673,12.404168545900546,-82.422419310778679,97.577580689221321,null,1000000000,2042000532.25,null,30.345226621684848,-30.893399334092255,null,40.029789109040159,-51.529019976686413,null,0,0]
[45448.75,45.448749999999997,20.241528085011414,1.5213728235086337,1.5134154161897031,0.84896933686558351,1,0,14993.226315742329,1.5707296300093161,6.9566001954349064,1.4265482274547943,1.0839851812365695,0.3962318547569697,1,0,1,0,0.97910024622301572,0.22575088466585785,12.376044976292192,-82.423853758275115,97.576146241724885,null,1000000000,2065588876.5625,null,30.336796459580345,-30.963398872246678,null,40.010095701536308,-51.460454886028401,null,0,0]
[45709,45.709000000000003,20.357153640533905,1.5216537683800304,1.5183040175133184,0.85180020128676015,1,0,15079.080979101904,1.5707300097559391,6.9956144476994897,1.4273582720444944,1.0849120084421233,0.39826889626771439,1,0,1,0,0.97887003186078081,0.22712054225297704,12.348181556538801,-82.426553232028098,97.573446767971902,null,1000000000,2089312681,null,30.328353925659343,-31.03372237525722,null,39.990674815703919,-51.392830856770843,null,0,0]
[45975.25,45.975250000000003,20.475446558703382,1.5219379067600567,1.5233178339169866,0.85467750426089739,1,0,15166.915000696777,1.5707303938084798,7.0355328609915757,1.4281776944861078,1.0858648541306193,0.40034929384237361,1,0,1,0,0.97863338754036999,0.22852315971961015,12.319940596037348,-82.430610464100951,97.569389535899049,null,1000000000,2113723612.5625,null,30.319703726608047,-31.105992933123968,null,39.971084054253765,-51.324617530977001,null,0,0]
[46241.5,46.241500000000002,20.593741110959204,1.5222187808676035,1.5283441788694923,0.85753590529824031,1,0,15254.749022293865,1.5707307734384137,7.0754559450082253,1.4289878703251597,1.0868223912483934,0.40242603455321818,1,0,1,0,0.97839561235421979,0.22992718428678549,12.291963128553302,-82.435964304306509,97.564035695693491,null,1000000000,2138276322.25,null,30.311040140078926,-31.178583506033153,null,39.95177017329884,-51.25738079827336,null,0,0]
[46507.75,46.507750000000001,20.712037269302655,1.5224964465893434,1.533382929167157,0.8603755437970535,1,0,15342.583043893123,1.5707311487216968,7.1153836211297588,1.4297889541497883,1.0877846074063633,0.40449911016761653,1,0,1,0,0.97815671071347321,0.23133262460955509,12.264244838255589,-82.442601139089959,97.557398860910041,null,1000000000,2162970810.0625,null,30.302362961129788,-31.251484769393794,null,39.932729061950255,-51.19111636969614,null,0,0]
[46774,46.774000000000001,20.830335006370667,1.5227709585444074,1.5384339629182988,0.86319655854198762,1,0,15430.417065494517,1.5707315197325564,7.1553158124823906,1.4305810971445216,1.0887514901988107,0.40656851260797872,1,0,1,0,0.9779166870599223,0.23273948934982777,12.236781493777658,-82.45050752161869,97.54949247838131,null,1000000000,2187807076,null,30.293671995649571,-31.324687602411608,null,39.913956682952545,-51.125819919207075,null,0,0]
[47046.25,47.046250000000001,20.951300212566327,1.5230484511238189,1.5436113989425155,0.86606203136250093,1,0,15520.230445331354,1.5707318947618663,7.1961524748983745,1.4313819999627557,1.0897449745226966,0.40868074294555412,1,0,1,0,0.97767009885750367,0.23417954004410774,12.208958563599843,-82.459891023432405,97.540108976567595,null,1000000000,2213349639.0625,null,30.284770730098323,-31.399842622511745,null,39.895035018325977,-51.060048400920671,null,0,0]
[47318.5,47.3185,21.072267013534479,1.5233227577936006,1.5488014246600632,0.86890832305374821,1,0,15610.043825170349,1.5707322654756664,7.2369937011576804,1.4321738636595427,1.09074331189289,0.41078911610389851,1,0,1,0,0.97742234699448705,0.23562109841770837,12.181393513144405,-82.470574023645241,97.529425976354759,null,1000000000,2239040442.25,null,30.275854672238317,-31.4752942987704,null,39.876386025730547,-50.995279724874869,null,0,0]
[47590.75,47.59075,21.193235381967174,1.5235939330664501,1.5540039139306621,0.87173557990996242,1,0,15699.857205011464,1.5707326319480188,7.2778394144272198,1.4329568394252383,1.091746488995923,0.41289362394582596,1,0,1,0,0.97717343631976661,0.23706417375352215,12.154082080083604,-82.482542670880918,97.517457329119082,null,1000000000,2264879485.5625,null,30.266923647299805,-31.551033506635296,null,39.858005617608256,-50.931509164245639,null,0,0]
[47863,47.863,21.31420529117608,1.5238620302193726,1.5592187419966435,0.87454394749249076,1,0,15789.670584854664,1.5707329942513015,7.3186895395807854,1.4337310751188006,1.0927544925027928,0.41499425850091221,1,0,1,0,0.97692337171613741,0.23850877534183418,12.127020086263586,-82.495783285711227,97.504216714288773,null,1000000000,2290866769,null,30.257977490803626,-31.627051321887429,null,39.839889780284423,-50.868731963823784,null,0,0]
[48141.75,48.141750000000002,21.43806494000814,1.5241333933676862,1.5645707300274554,0.87739994527226428,1,0,15881.6282694529,1.5707333609589198,7.3605194605902939,1.4345148912212413,1.0937915488992451,0.41714102469417752,1,0,1,0,0.9766661463433618,0.23998945801554375,12.099566150624293,-82.510643796453977,97.489356203546023,null,1000000000,2317628093.0625,null,30.24880190468506,-31.70516362066676,null,39.821611430763696,-50.805480175787203,null,0,0]
[48420.5,48.420499999999997,21.561926149358708,1.5244016388764559,1.5699353927573174,0.88023644746432927,1,0,15973.585954053249,1.5707337234443697,7.4023538525560477,1.4352898483242045,1.0948336365857905,0.41928371406433812,1,0,1,0,0.97640772175254886,0.24147176042518254,12.072365104644646,-82.526809255148407,97.473190744851593,null,1000000000,2344544820.25,null,30.23961013841053,-31.783549676057014,null,39.803602151058577,-50.743259579091401,null,0,0]
[48699.25,48.699249999999999,21.685788892488468,1.5246668201278191,1.5753126006967246,0.8830536078314325,1,0,16065.543638655672,1.5707340817801534,7.4441926401012743,1.4360560948603287,1.0958807412094647,0.42142231859495533,1,0,1,0,0.97614810329577517,0.24295569256635483,12.04541272553376,-82.544265523397442,97.455734476602558,null,1000000000,2371616950.5625,null,30.230402046684532,-31.86220052834042,null,39.785857863673684,-50.682064995057019,null,0,0]
[48978,48.978000000000002,21.809653143265216,1.5249289892929594,1.5807022258173939,0.8858515792745848,1,0,16157.501323260134,1.5707344360371223,7.4860357495264687,1.4368137759850423,1.0969328484031409,0.42355683044958559,1,0,1,0,0.97588729636282745,0.24444126444264602,12.018704874777395,-82.562998641241222,97.437001358758778,null,1000000000,2398844484,null,30.221177494025035,-31.941107415787904,null,39.768374565576821,-50.621891225453332,null,0,0]
[49263.25,49.263249999999999,21.936407242555983,1.525194206754406,1.5862302511216897,0.88869508817570808,1,0,16251.60331261978,1.5707347944044368,7.5288589717588925,1.4375804057682557,1.0980146529426864,0.42573687074649114,1,0,1,0,0.9756191831267661,0.2459631854367787,11.991623156595512,-82.583476063221212,97.416523936778788,null,1000000000,2426867800.5625,null,30.211720667104743,-32.022110405969073,null,39.75074967431523,-50.561365657252153,null,0,0]
[49548.5,49.548499999999997,22.063162867130799,1.525456376819277,1.5917710128154334,0.89151882395742754,1,0,16345.705301981488,1.5707351486455203,7.5716865688085075,1.4383383634437334,1.0991016655929886,0.42791260924267471,1,0,1,0,0.97534983688281129,0.24748684475039487,11.964788997104268,-82.605261560631362,97.394738439368638,null,1000000000,2455053852.25,null,30.202246345564806,-32.103363559881977,null,39.733389836363926,-50.501898000749385,null,0,0]
[49833.75,49.833750000000002,22.189919990850989,1.5257155516748282,1.5973243783595554,0.89432294758843478,1,0,16439.807291345227,1.5707354988312292,7.6145184668572856,1.439087794475761,1.1001938709169072,0.43008403812032386,1,0,1,0,0.97507926353005858,0.24901225312900954,11.938198223035206,-82.62834073806961,97.37165926193039,null,1000000000,2483402639.0625,null,30.192754413938985,-32.184858099169077,null,39.71629099392068,-50.443482638900534,null,0,0]
[50119,50.119,22.316678588171449,1.5259717823242529,1.6028902167523471,0.89710761904295089,1,0,16533.909280710952,1.5707358450308062,7.6573545937314931,1.4398288411124516,1.1012912534649444,0.43225114975512668,1,0,1,0,0.97480746900947357,0.25053942132669699,11.911846745258698,-82.65269938502891,97.34730061497109,null,1000000000,2511914161,null,30.183244766082026,-32.266585440740251,null,39.699449164001138,-50.386113944288667,null,0,0]
[50410.75,50.41075,22.446327135645408,1.5262308580582726,1.6085956515328197,0.89993578846093025,1,0,16630.155574832006,1.5707361950663568,7.7011711295839573,1.4405782458310221,1.1024189815143304,0.43446316975098254,1,0,1,0,0.97452822411051254,0.25210322079566977,11.88513815734299,-82.678922007370787,97.321077992629213,null,1000000000,2541243715.5625,null,30.173499994010431,-32.350407178835567,null,39.682485348157016,-50.328514828535191,null,0,0]
[50702.5,50.702500000000001,22.575977172417957,1.5264869581526552,1.6143138617267729,0.90274394436768879,1,0,16726.401868955068,1.5707365410735903,7.7449919415330299,1.4413191707661988,1.1035520926955131,0.43667065799002319,1,0,1,0,0.97424771446192826,0.2536688839826467,11.858671504059599,-82.706453585478386,97.293546414521614,null,1000000000,2570743506.25,null,30.163736492940085,-32.43445489138594,null,39.665782195943976,-50.271998694092417,null,0,0]
[50994.25,50.994250000000001,22.705628672977227,1.5267401335471511,1.6200447120555395,0.90553225463048959,1,0,16822.648163080114,1.5707368831216477,7.7888169574052268,1.4420517582360919,1.1046905704436185,0.43887360693625216,1,0,1,0,0.97396594655694013,0.2552364224211629,11.832442670889815,-82.735279498675226,97.264720501324774,null,1000000000,2600413533.0625,null,30.153954177448004,-32.518719996344984,null,39.649335678266276,-50.216559502330256,null,0,0]
[51286,51.286000000000001,{"$f":"SQRT(1+(A461/pole1)^2)","v":22.835281612390464},{"$f":"ATAN(A461/pole1)","v":1.5269904340261378},{"$f":"SQRT(1+(A461/Zero1)^2)","v":1.6257880688509265},{"$f":"ATAN(A461/Zero1)","v":0.9083008859867141},{"$f":"IF(VIN_nom>Vout, 1, SQRT(1+(A461/z_RHP)^2))","v":1},{"$f":"IF(VIN_nom>Vout, 0, -ATAN(A461/z_RHP))","v":0},{"$f":"SQRT(1+(A461/Pole2)^2)","v":16918.894457207101},{"$f":"ATAN(A461/Pole2)","v":1.5707372212780963},7.8326461066355053,1.4427761474095908,{"$f":"SQRT(1+(A461/pole4)^2)","v":1.1058343981836953},{"$f":"ATAN(A461/pole4)","v":0.44107200926086537},{"$f":"IF(VOUT_setting=1,1,SQRT(1+(A461*zterm1)^2))","v":1},{"$f":"IF(VOUT_setting=1,0,ATAN(((A461*zterm1))))","v":0},1,{"$f":"IF(VOUT_setting=1,0,ATAN(A461*$Q$4/(1+Afbr-$Q$5*(A461)^2)))","v":0},{"$f":"SQRT((1-(Z461/pterm2))^2+(A461/pterm1)^2)","v":0.97368292693517877},{"$f":"IF((ATAN((A461/pterm1)/(1-A461^2/pterm2))>0),ATAN((A461/pterm1)/(1-A461^2/pterm2)),PI()+ATAN((A461/pterm1)/(1-A461^2/pterm2)))","v":0.25680584765386505},{"$f":"20*LOG10(((E461*K461*G461*O461)/(C461*I461*S461*M461*Q461))*Adc)","v":11.80644762708247},{"$f":"((F461+L461+H461+P461)-(D461+J461+T461+N461+R461))*radconv","v":-82.765385317564551},{"$f":"IF(V461>0,V461,V461+180)","v":97.234614682435449},null,{"$f":"IF(U461<0,A461,1000000000)","v":1000000000},{"$f":"A461^2","v":2630253796},null,{"$f":"20*LOG10((K461/(I461*M461))*AEA)","v":30.14415297092745},{"$f":"(L461-(J461+N461))*radconv","v":-32.603194103884455},null,{"$f":"20*LOG10((E461*G461/(C461*S461))*Acs*Am)","v":39.633141840979476},{"$f":"(F461+H461-(D461+T461))*radconv","v":-50.162191213680089},null,{"$f":"SUM((U462<0)*(U461>0))*A461","v":0},0]
[51584.75,{"$f":"A462/1000","v":51.58475},22.968046799154312,1.5272438116136586,1.6316820490564359,0.91111572567864596,1,0,17017.450002609043,1.5707375635841676,7.8775310662301745,1.4435095633995518,1.1070111967016643,0.44331843916995356,1,0,1,0,0.97339182653665468,0.25841489564246362,11.780067026665098,-82.797524933020256,97.202475066979744,null,1000000000,2660986432.5625,null,30.134096955198846,-32.689903028587246,null,39.616817256290709,-50.107621904433003,null,0,0]
[51883.5,51.883499999999998,23.100813443522213,1.5274942767575825,1.6375888644826011,0.91391028101505611,1,0,17116.005548012959,1.5707379019481784,7.9224202151261673,1.4442346685733141,1.1081935698122816,0.44556008677138542,1,0,{"$f":"IF(VOUT_setting=1,1,SQRT((1+Afbr-$Q$5*(A463)^2)^2+(A463*$Q$4)^2))","v":1},0,0.97309942766425761,0.26002594657739458,11.753923275238034,-82.830976588868296,97.169023411131704,null,1000000000,2691897572.25,null,30.124020995444202,-32.776813896074316,null,39.600749464618296,-50.05416269279398,null,0,0]
[52182.25,52.182250000000003,23.23358152050605,1.5277418793556046,1.6435083767389937,0.91668472728922468,1,0,17214.561093418808,1.5707382364378357,7.9673134825138536,1.4449516026482585,1.1093814996914311,0.44779694486363175,1,0,1,0,0.97280573749201293,0.2616390128814548,11.72801230529041,-82.865725398290493,97.134274601709507,null,1000000000,2722987215.0625,null,30.113925036108363,-32.863918292391482,null,39.584934454006508,-50.001807105899047,null,0,0]
[52481,52.481000000000002,23.366351005685367,1.5279866681727514,1.6494404491264578,0.91943923851915554,1,0,17313.116638826559,1.5707385671193039,8.0122107991641975,1.4456605022441107,1.11057496850767,0.4500290064676179,1,0,1,0,0.97251076324565289,0.26325410698712565,11.702330133035055,-82.901756673334404,97.098243326665596,null,1000000000,2754255361,null,30.103809029993137,-32.951207993724445,null,39.569368287866375,-49.950548679609966,null,0,0]
[52786.5,52.786499999999997,23.502121734914319,1.5282341275784901,1.6555193999360978,0.92223554978472499,1,0,17413.898962249648,1.5707389014013808,8.0581266491826948,1.4463772491826095,1.1118011122144109,0.4523065322775488,1,0,1,0,0.97220780397161177,0.26490780276652975,11.676300239247768,-82.939913203002504,97.060086796997496,null,1000000000,2786414582.25,null,30.093443689346614,-33.0406531888651,null,39.553703734725609,-49.899260014137433,null,0,0]
[53092,53.091999999999999,23.637893886790199,1.5284787442672905,1.6616112010652082,0.92501137894324748,1,0,17514.681285674655,1.570739231836431,8.1040465919614988,1.4470858738782677,1.1130330102475106,0.45457902835062508,1,0,1,0,0.97190351739166581,0.26656364534119759,11.650501432627339,-82.979380364709371,97.020619635290629,null,1000000000,2818760464,null,30.08305731142044,-33.130275351128653,null,39.538291306031361,-49.849105013580711,null,0,0]
[53397.5,53.397500000000001,23.77366743693867,1.5287205669146597,1.667715711695567,0.92776690790097849,1,0,17615.463609101556,1.5707395584904837,8.1499705583202449,1.4477865129165046,1.1142706435216334,0.45684648793650756,1,0,1,0,0.97159791140136531,0.26822164803629872,11.62492971210346,-83.020143079620482,96.979856920379518,null,1000000000,2851293006.25,null,30.072649870895141,-33.220066271764296,null,39.523127026032775,-49.800076807856158,null,0,0]
[53703,53.703000000000003,23.909442361538794,1.528959643091772,1.6738327927715604,0.93050231714645004,1,0,17716.245932530317,1.5707398814280655,8.1958984806231161,1.4484792998529326,1.1155139929474842,0.45910890452189895,1,0,1,0,0.97129099395357543,0.26988182418716278,11.599581159756017,-83.062186474530023,96.937813525469977,null,1000000000,2884012209,null,30.062221350305968,-33.310017929111766,null,39.508206994274509,-49.752168545418272,null,0,0]
[54015.75,54.015749999999997,24.048440840110228,1.5292015964561063,1.680107919997275,0.93328198735916112,1,0,17819.419980494058,1.5707402082454927,8.2429203742753732,1.4491805302434662,1.1167927503367754,0.46141978135331169,1,0,1,0,0.97097544272003866,0.27158366432445669,11.573858215883268,-83.106538939672248,96.893461060327752,null,1000000000,2917701248.0625,null,30.051523497676321,-33.402262602047038,null,39.493181903031406,-49.704276337625224,null,0,0]
[54328.5,54.328499999999998,24.187440710330922,1.5294407689294045,1.6863959320214836,0.93604094981740804,1,0,17922.594028459673,1.5707405313001745,{"$f":"SQRT(1+(A471/Zero2)^2)","v":8.2899462751874839},{"$f":"ATAN(A471/Zero2)","v":1.449873805313163},1.1180774579084265,0.46372535992720837,1,0,1,0,0.97065853409678171,0.27328781061602236,11.548361107014397,-83.152202694261732,96.847797305738268,null,1000000000,2951585912.25,null,30.040803539502619,-33.494659297907248,null,39.478404752336239,-49.657543396354512,null,0,0]
[54641.25,54.641249999999999,24.326441948345472,1.5296772081540826,1.6926966852512466,0.93877939352697504,1,0,18025.768076427146,1.570740850656722,8.3369761155488877,1.4505592590205392,1.119368095175225,0.46602563401691416,1,0,1,0,0.97034027680438995,0.27499427740160387,11.523085887629021,-83.199162432063076,96.800837567936924,null,1000000000,2985666201.5625,null,30.030061480738162,-33.5871999883745,null,39.463871591715318,-49.611962443688569,null,0,0]
[54954,54.954000000000001,24.465444530840383,1.5299109606910575,1.6990100379348607,0.94149750592383241,1,0,18128.942124396432,1.5707411663782742,8.384009829064933,1.4512370223478972,1.1206646416499921,0.46832059764891032,1,0,1,0,0.97002067962728777,0.27670307903155528,11.498028695076998,-83.247403060372008,96.752596939627992,null,1000000000,3019942116,null,30.019297333725277,-33.679876830075884,null,39.449578546176184,-49.567526230296096,null,0,0]
[55274,55.274000000000001,24.607670763251139,1.5301473985827239,1.7054826383226169,0.94425777823557677,1,0,18234.507896900828,1.5707414857207007,8.432137793758173,1.4519226709410957,1.1219973388623306,0.47066325936892917,1,0,1,0,0.96969229611692564,0.27845392480761649,11.472612362970755,-83.298072229254018,96.701927770745982,null,1000000000,3055215076,null,30.008260816209969,-33.77483498592224,null,39.435198731585245,-49.523237243331799,null,0,{"$f":"IF(AH474>0,W474,0)","v":0}]
[55594,55.594000000000001,24.749898355491098,1.5303811190626726,1.7119681346439852,0.94699715765530612,1,0,18340.073669407062,1.5707418013868464,8.480269677521882,1.4526005367110639,1.1233361790376921,0.47300034972046845,1,0,1,0,0.9693625286925176,0.28020724536132863,11.447416358981336,-83.350051067152265,96.649948932847735,null,1000000000,3090692836,null,29.997201223116562,-33.869919638157157,null,39.421062320689238,-49.480131428995136,null,0,0]
[55914,55.914000000000001,24.89212728425106,1.5306121686854846,1.7184663808911165,0.94971583985014851,1,0,18445.639441915107,1.5707421134398303,8.528405414001714,1.4532707508121472,1.1246811402380039,0.47533186311561076,1,0,1,0,0.96903138697268087,0.28196305609782824,11.422436802079661,-83.403324082058319,96.596675917941681,null,1000000000,3126375396,null,29.986118589864368,-33.965122955642549,null,39.407165397039748,-49.438201126415777,null,0,0]
[56234,56.234000000000002,25.034357526751318,1.5308405929489157,1.7249772329714066,0.95241401876560172,1,0,18551.205214424921,1.5707424219413344,8.5765449383277268,1.4539334414819023,1.1260322005299479,0.47765779423560267,1,0,1,0,0.96869888064701082,0.28372137243318241,11.39766989356405,-83.457876003139887,96.542123996860113,null,1000000000,3162262756,null,29.975012958778642,-34.060437289699628,null,39.393504119609865,-49.397438713440245,null,0,0]
[56561.5,56.561500000000002,25.179922627616406,1.5310716989277458,1.7316535872365955,0.95515440710078781,1,0,18659.245184729745,1.5707427340589324,8.6258165886297498,1.4546040048124422,1.1274212186038242,0.48003245403604233,1,0,1,0,0.96835717843533786,0.28552350978039398,11.372538813618906,-83.515014997306906,96.484985002693094,null,1000000000,3199203282.25,null,29.96362327792373,-34.158092708440691,null,39.379762720519629,-49.356922288866222,null,0,0]
[56889,56.889000000000003,25.325489057880564,1.5313001482061068,1.7383428458035486,0.95787372533451609,1,0,18767.285155036363,1.5707430425829174,8.6750920735150547,1.4552669506901226,1.1288165785493984,0.48240125640750736,1,0,1,0,0.96801406766725595,0.28732830425978939,11.347622671336037,-83.573461880139931,96.426538119860069,null,1000000000,3236358321,null,29.95220961926811,-34.255848763223462,null,39.366260236892387,-49.317613116916483,null,0,0]
[57216.5,57.216500000000003,25.471056794751359,1.5315259863092798,1.7450448602745776,0.96057217578283483,1,0,18875.325125344752,1.5707433475749983,8.7243713280101556,1.4559224076078363,1.1302182568777728,0.48476419651015584,1,0,1,0,0.96766955896239071,0.2891357724312707,11.322917649534931,-83.633200981134863,96.366799018865137,null,1000000000,3273727872.25,null,29.940772048897351,-34.353697818180599,null,39.352992785462035,-49.279503162954242,null,0,0]
[57544,57.543999999999997,25.616625815954215,1.5317492577288161,1.7517594842421695,0.96324995888429255,1,0,18983.365095654874,1.570743649095478,8.7736542885964059,1.4565705011974919,1.1316262301103288,0.48712126978992454,1,0,1,0,0.96732366301939143,0.29094593086585002,11.298420012814027,-83.694216858984277,96.305783141015723,null,1000000000,3311311936,null,29.929310639324243,-34.451632417660498,null,39.339956558314249,-49.2425844413238,null,0,0]
[57879,57.878999999999998,25.765529784957227,1.5319750320389023,1.7586407736043537,0.9659678895453,1,0,19093.879263760122,1.5707439539906778,8.8240696362360591,1.4572259464834452,1.1330729353320776,0.48952624750312179,1,0,1,0,0.96696842177676512,0.29280034397940696,11.273572114311163,-83.7579351565536,96.2420648434464,null,1000000000,3349978641,null,29.917562172421334,-34.551890711185536,null,39.326857126714287,-49.206044445368065,null,0,0]
[58214,58.213999999999999,25.914435052240073,1.5321982117457937,1.7655349529796605,0.96866461368195866,1,0,19204.393431867124,1.5707442553767599,8.8744887316986691,1.4578739444142108,1.1345261774186561,0.49192507787289097,1,0,1,0,0.96661175193015758,0.29465760709409483,11.248933555146976,-83.822957415821094,96.177042584178906,null,1000000000,3388869796,null,29.905788934885734,-34.652223288840183,null,39.313991805085699,-49.170734126980896,null,0,0]
[58549,58.548999999999999,26.063341595550735,1.5324188412979616,1.7724418719551589,0.97134033975668199,1,0,19314.907599975853,1.5707445533139586,8.9249115114670197,1.4585146206661683,1.1359859312826581,0.49431775693716168,1,0,1,0,0.96625366518878075,0.29651773798014563,11.224500589983609,-83.889267833354481,96.110732166645519,null,1000000000,3427985401,null,29.89399102351193,-34.752622726339553,null,39.30135675129614,-49.136645107014914,null,0,0]
[58884,58.884,26.212249393142628,1.5326369641348634,1.7793613821775414,0.97399527420090248,1,0,19425.421768086275,1.5707448478611374,8.9753379134466442,1.4591480981156864,1.1374521718533355,0.4967042810358806,1,0,1,0,0.9658941733496762,0.29838075441884948,11.200269554451616,-83.956850842564052,96.043149157435948,null,1000000000,3467325456,null,29.882168541025802,-34.853081777053347,null,39.288948198250274,-49.103769065510718,null,0,0]
[59227,59.226999999999997,26.364714475214406,1.532857742988645,1.7864590275015639,0.9766922811927512,1,0,19538.575080511509,1.5707451459899344,9.0269722176102913,1.4597893701284488,1.138960121876327,0.49914141604988516,1,0,1,0,0.96552465321350356,0.30029126912213905,11.175665343870788,-84.027350302494654,95.972649697505346,null,1000000000,3507837529,null,29.870038385567582,-34.955994229247608,null,39.276474143127672,-49.071356073247081,null,0,0]
[59570,59.57,26.517180827611551,1.5330759830199894,1.7935695643548093,0.97936792315965493,1,0,19651.728392938461,1.5707454406855206,9.0786101917074014,1.4604233474530084,1.1404748189847635,0.50157209181238904,1,0,1,0,0.96515368538247559,0.30220484660184677,11.151265299221919,-84.099151578825726,95.900848421174274,null,1000000000,3548584900,null,29.857882707359572,-35.058954351730556,null,39.264229776686804,-49.040197227095177,null,0,0]
[59913,59.912999999999997,26.669648428547287,1.533291727750477,1.8006928400199111,0.98202241511413824,1,0,19764.881705367097,1.5707457320068612,9.1302517734698334,1.461050153353739,1.1419962363314706,0.5039963053606934,1,0,1,0,0.96478128280754638,0.30412150597783866,11.127065738091115,-84.172238712437363,95.827761287562637,null,1000000000,3589567569,null,29.845701634363326,-35.161954915602053,null,39.252211288552246,-49.01028379683531,null,0,0]
[60256,60.256,26.822117256730046,1.533505019713046,1.8078287039150167,0.98465596987528414,1,0,19878.035017797392,1.570746020011579,9.1818969020260059,1.461669908344563,1.1435243470933545,0.5064140540516473,1,0,1,0,0.96440745853769416,0.30604126638074852,11.103063058434824,-84.246595989677829,95.753404010322171,null,1000000000,3630785536,null,29.833495299992336,-35.26498886778316,null,39.240414943266948,-48.98160712189464,null,0,0]
[60607,60.606999999999999,26.978143457993159,1.5337207905358967,1.8151438791168686,0.98732949301499773,1,0,19993.827474542617,1.5707463113587981,9.2347501914469685,1.462296941682202,1.1450950003723472,0.50888149816548878,1,0,1,0,0.9640234572315648,0.30800903286762871,11.078700696687262,-84.323986332699846,95.676013667300154,null,1000000000,3673208449,null,29.820978262404321,-35.370453330916497,null,39.228569619107404,-48.953533001783327,null,0,0]
[60958,60.957999999999998,27.13417090083426,1.5339340799093293,1.8224719242626848,0.98998153484678397,1,0,20109.619931289522,1.5707465993508261,9.2876070703770726,1.4629168382183246,1.1466726061872863,0.51134216774837127,1,0,1,0,0.96363799510327031,0.30998008728970144,11.05453712452073,-84.402674236572793,95.597325763427207,null,1000000000,3715877764,null,29.808435070442894,-35.475938358385534,null,39.216949238902295,-48.926735878187259,null,0,0]
[61309,61.308999999999997,27.290199563957767,1.5341449303759982,1.8298126847275782,0.99261231637332858,1,0,20225.412388038076,1.5707468840452892,9.3404674778781729,1.4635297186400962,1.148257135881626,0.51379606098642572,1,0,1,0,0.96325108645762314,0.31195445018017148,11.030568730229575,-84.482643637265539,95.517356362734461,null,1000000000,3758793481,null,29.795865883238587,-35.581436934699788,null,39.205550031815449,-48.901206702565773,null,0,0]
[61660,61.66,27.446229426552183,1.5343533835120275,1.8371660080918317,0.99522205624537274,1,0,20341.204844788244,1.5707471654985017,9.3933313543798036,1.4641357009392204,1.149848560831356,0.51624317640219186,1,0,1,0,0.96286274570863573,0.31393214208232589,11.006791981600998,-84.56387872434118,95.43612127565882,null,1000000000,3801955600,null,29.783270864873472,-35.686942218006898,null,39.194368301551989,-48.876936506334303,null,0,0]
[62019,62.018999999999998,27.605816744922176,1.5345641501539882,1.8446997676413006,0.99786973632680775,1,0,20459.636445853463,1.5707474500710583,9.447403633362315,1.4647484792896504,1.1514833605570669,0.51873905403404985,1,0,1,0,0.96246408759108759,0.31595837469459825,10.982667959739089,-84.648258392348396,95.351741607651604,null,1000000000,3846356361,null,29.770362235541921,-35.794852164166606,null,39.183152909021629,-48.85340622818179,null,0,0]
[62378,62.378,27.765405275516603,1.5347724939383605,1.8522463536744336,1.0004958598681497,1,0,20578.068046920311,1.5707477313680511,9.5014794194417966,1.4653542828524562,1.153125312974477,0.52122783929771754,1,0,1,0,0.962063962197516,0.31798813329861086,10.95873719059953,-84.733929439510305,95.266070560489695,null,1000000000,3891014884,null,29.757426946199303,-35.902755185780123,null,39.172157429224683,-48.83117425373014,null,0,0]
[62737,62.737000000000002,27.924994997552243,1.5349784563863711,1.8598056100520768,1.0031006532778699,1,0,20696.499647988778,1.570748009445712,9.5555586530772949,1.4659532295996078,1.1547743875727454,0.52370953168119505,1,0,1,0,0.9616623853075088,0.32002143990421028,10.934996139874722,-84.820875748229795,95.179124251770205,null,1000000000,3935931169,null,29.744465186972697,-36.010644497437902,null,39.161378137726487,-48.810231250791873,null,0,0]
[63096,63.095999999999997,28.08458589071812,1.5351820780762864,1.867377382903278,1.0056843404593379,1,0,20814.93124905882,1.5707482843589924,9.6096412760643943,1.4665454348672446,1.156430553883097,0.52618413102486294,1,0,1,0,0.96125937282209006,0.32205831653013844,10.911441351607195,-84.90908146206209,95.09091853793791,null,1000000000,3981105216,null,29.731477152421903,-36.118513484868849,null,39.150811384009749,-48.790567977193241,null,0,0]
[63463.25,63.463250000000002,28.247845453739597,1.5353879983794285,1.875135952027871,1.0083057935665845,1,0,20936.084467703811,1.5707485623716149,9.6649701925993465,1.4671443912346342,1.1581320860441238,0.52870825868593108,1,0,1,0,0.9608456301543935,0.32414571859329722,10.88753447136876,-85.000601074499443,94.999398925500557,null,1000000000,4027584100.5625,null,29.718163665602617,-36.228833603912364,null,39.1402179905906,-48.771767470587065,null,0,0]
[63830.5,63.830500000000001,28.411106200793387,1.5355915521023435,1.8829073008721406,1.0109056252993738,1,0,21057.2376863504,1.5707488371851352,9.7203025369569822,1.4677365287530864,1.1598409752428758,0.53122496433202016,1,0,1,0,0.96043041920582883,0.32623690328412291,10.863815438742233,-85.093405891820225,94.906594108179775,null,1000000000,4074332730.25,null,29.704823107069252,-36.33911898079225,null,39.129839516497441,-48.754286911027961,null,0,0]
[64197.75,64.197749999999999,28.574368111584452,1.5357927797929465,1.8906912718498272,1.0134840673401053,1,0,21178.390904998563,1.5707491088544565,9.7756382509305269,1.4683219627995727,1.1615571890082126,0.53373424891079702,1,0,1,0,0.96001375739677053,0.32833189419957881,10.840280795421457,-85.187479761661024,94.812520238338976,null,1000000000,4121351105.0625,null,29.69145569805919,-36.449363062337994,null,39.119672282186727,-48.738116699323051,null,0,0]
[64565,64.564999999999998,28.737631166278796,1.5359917210784793,1.8984877097052779,1.0160413487123334,1,0,21299.544123648269,1.5707493774332313,9.8309772776202156,1.4689008061718343,1.163280694921849,0.5362361137381596,1,0,1,0,0.95959566228277404,0.33043071494372739,10.816927160265081,-85.282806800460676,94.717193199539324,null,1000000000,4168639225,null,29.67806166371809,-36.559559464184574,null,39.109712681371455,-48.723247336276124,null,0,0]
[64941,64.941000000000003,28.904785247593946,1.53619307395982,1.9064826596460103,1.018637872645918,1,0,21423.583906392636,1.5707496492639694,9.8876381710825516,1.4694867279797577,1.1650527856587767,0.53878990205321498,1,0,1,0,0.95916613928565198,0.33258353407169367,10.793201184334716,-85.381687078413577,94.618312921586423,null,1000000000,4217333481,null,29.664321161252015,-36.672325484571289,null,39.099727207907165,-48.709361593842281,null,0,0]
[65317,65.316999999999993,29.071940487319363,1.5363921114076253,1.9144903555695534,1.0212126929730689,1,0,21547.623689138563,1.5707499179650977,9.9443024203313737,1.4700659726295293,1.1668324515692894,0.54133591679783122,1,0,1,0,0.95873515155001254,0.33474041779303937,10.769658010941317,-85.48184810178337,94.51815189821663,null,1000000000,4266310489,null,29.650553238856379,-36.785028505847798,null,39.089951956909402,-48.696819595935587,null,0,0]
[65693,65.692999999999998,29.239096865587701,1.5365888731171482,1.922510638206125,1.0237660469664354,1,0,21671.663471886033,1.5707501835903543,10.000969968326277,1.4706386532315507,1.1686196580451773,0.54387416055454907,1,0,1,0,0.95830271836045355,0.33690139145788189,10.746294249737007,-85.583273672972979,94.416726327027021,null,1000000000,4315570249,null,29.636758149497815,-36.897662198313157,null,39.080383285063654,-48.685611474659851,null,0,0]
[66069,66.069000000000003,29.406254362983237,1.5367833978817778,1.9305433506843575,1.0262981690785615,1,0,21795.703254635013,1.5707504461922537,10.0576407593091,1.4712048803643414,1.1704143705434256,0.54640463629069425,1,0,1,0,0.95786885915259312,0.33906648042086901,10.723106586496538,-85.685947871594507,94.314052128405493,null,1000000000,4365112761,null,29.622936149526744,-37.010220399308984,null,39.071017621794248,-48.675727472285537,null,0,0]
[66453.75,66.453749999999999,29.577302967436971,1.5369801734006496,1.938775700556838,1.0288674797863395,1,0,21922.629601478755,1.5707507118290589,10.115633652152946,1.4717777166116948,1.1722585823942087,0.54898596164003322,1,0,1,0,0.95742344773928412,0.34128624028679133,10.699558229714629,-85.792287659104943,94.207712340895057,null,1000000000,4416100889.0625,null,29.608764907462795,-37.12531356805011,null,39.061640507076298,-48.666974091054819,null,0,0]
[66838.5,66.838499999999996,29.748352703971694,1.5371746860520585,1.9470207407027091,1.0314150466956549,1,0,22049.555948324029,1.5707509744076338,10.17362982651124,1.4723440219796797,1.1741105807175301,0.55155916071722422,1,0,1,0,0.95697658482689862,0.34351036294143095,10.676187476384518,-85.899902006627855,94.100097993372145,null,1000000000,4467385082.25,null,29.594566040771927,-37.240315152294521,null,39.052468620437054,-48.659586854333327,null,0,0]
[67223.25,67.223249999999993,29.919403553171026,1.5373669746319651,1.9552783105845042,1.0339411120147366,1,0,22176.482295170805,1.5707512339804894,10.231629226581935,1.472903907165511,1.1759703287253855,0.55412423792009446,1,0,1,0,0.95652829173498832,0.34573887555993438,10.652991009877988,-86.008774729022349,93.991225270977651,null,1000000000,4518965340.5625,null,29.580339833789342,-37.355219064544563,null,39.043498360913105,-48.6535556644778,null,0,0]
[67608,67.608000000000004,30.090455496059956,1.5375570770548403,1.9635482521233487,1.0364459149782592,1,0,22303.408642019062,1.5707514905989417,10.289631797818068,1.4734574803867151,1.1778377897086625,0.55668119804626215,1,0,1,0,0.95607858995149486,0.34797180531838512,10.629965588365142,-86.118889925981279,93.881110074018721,null,1000000000,4570841664,null,29.566086573687066,-37.470019382216194,null,39.034726199502536,-48.648870543765092,null,0,0]
[68001.75,68.001750000000001,30.265509767002037,1.5377494015179527,1.9720242893138089,1.0389875421406005,1,0,22433.304026221995,1.5707517502136155,10.348994382012448,1.4740175779130853,1.1797568814872452,0.55928957141779789,1,0,1,0,0.95561693292201566,0.35026156904398253,10.60657534758958,-86.232851030237569,93.767148969762431,null,1000000000,4624238003.0625,null,29.55147219665017,-37.587391818382002,null,39.025950335763866,-48.64545921185556,null,0,0]
[68395.5,68.395499999999998,30.440565144550334,1.5379395139770939,1.9805129564355406,1.0415073981527976,1,0,22563.199410426419,1.5707520068391077,10.408360175748644,1.4745712863948317,1.181683973770765,0.56188945495029607,1,0,1,0,0.9551538466060614,0.3525560165651192,10.583357608764391,-86.348080614817363,93.651919385182637,null,1000000000,4677944420.25,null,29.536830102858431,-37.704643716626641,null,39.017374690730414,-48.643436898190721,null,0,0]
[68789.25,68.789249999999996,30.615621609722652,1.538127452362325,1.9890140917833885,1.0440057299608516,1,0,22693.094794632318,1.5707522605267488,10.467729124419682,1.4751187141981452,1.1836190274815017,0.56448085505016021,1,0,1,0,0.95468935458752924,0.35485517700577895,10.560309127406391,-86.464562533746374,93.535437466253626,null,1000000000,4731960915.5625,null,29.522160608061313,-37.821769238025638,null,39.008995704169543,-48.642793295720686,null,0,0]
[69183,69.183000000000007,30.790679143968337,1.5383132537417383,1.9975275361694489,1.0464827813848838,1,0,22822.990178839656,1.5707525113267005,10.527101174647573,1.4756599672597612,1.1855620036359458,0.56706377853780654,1,0,1,0,0.95422348063819884,0.35715907948601511,10.53742673242547,-86.582280933389271,93.417719066610729,null,1000000000,4786287489,null,29.50746403028408,-37.938762706506274,null,39.000809886965854,-48.643518226882954,null,0,0]
[69586,69.585999999999999,30.969850229044077,1.5385012448853594,2.0062535615778541,1.0489962389332543,1,0,22955.937073661593,1.5707527650793758,10.587871154102183,1.47620764951983,1.1875587875279738,0.56969861012317824,1,0,1,0,0.9537452563465858,0.35952204622295436,10.514175533021369,-86.704028930803929,93.295971069196071,null,1000000000,4842211396,null,29.492394488848603,-38.058362093153711,null,38.992628228997226,-48.645666837650218,null,0,0]
[69989,69.989000000000004,31.149022396023849,1.5386870733492761,2.0149921516095173,1.0514879114534736,1,0,23088.883968484985,1.5707530159098111,10.64864427320166,1.4767490805610817,1.1895637881425973,0.57232457791108216,1,0,1,0,0.95326563542759235,0.3618900421239411,10.491091820166323,-86.827039498682268,93.172960501317732,null,1000000000,4898460121,null,29.477297257615405,-38.177811622638622,null,38.984641747375385,-48.649227876043639,null,0,0]
[70392,70.391999999999996,31.328195626344776,1.5388707762271463,2.0237431435010644,1.053958050411083,1,0,23221.830863309813,1.5707532638681965,10.709420478496044,1.4772843664907727,1.1915769640023446,0.57494169052098443,1,0,1,0,0.95278464398470752,0.36426309838825061,10.46817241972667,-86.951296559243602,93.048703440756398,null,1000000000,4955033664,null,29.462172683737325,-38.297105712197741,null,38.976846920813806,-48.65419084704584,null,0,0]
[70795,70.795000000000002,31.507369901866127,1.539052389769441,2.0325063770632248,1.0564069039951507,1,0,23354.777758136061,1.5707535090035796,10.770199717739175,1.4778136110352571,1.1935982737410213,0.57754995699952838,1,0,1,0,0.95230230833116658,0.36664124620475336,10.445414229464461,-87.076784334353746,92.923215665646254,null,1000000000,5011932025,null,29.447021116065795,-38.416238939893475,null,38.969240298223127,-48.660545394460314,null,0,0]
[71207.25,71.207250000000002,31.690657801279691,1.5392360469765167,2.0414832538460317,1.0588901973058322,1,0,23490.776163576997,1.570753756894552,10.832377099921596,1.4783488579943194,1.1956743513612353,0.58020894748208274,1,0,1,0,0.95180753850834465,0.36907927999696888,10.422297315616959,-87.206409681724452,92.793590318275548,null,1000000000,5070472452.5625,null,29.43149421170359,-38.537934683803364,null,38.961650288737829,-48.668474997921066,null,0,0]
[71619.5,71.619500000000002,31.873946757324671,1.5394175919731807,2.0504726096609431,1.061351731966568,1,0,23626.774569019359,1.5707540019317472,10.894557550040739,1.4788779952827946,1.197758853334181,0.58285870157498654,1,0,1,0,0.95131141843765965,0.37152270773791735,10.399342751932959,-87.337290426346172,92.662709573653828,null,1000000000,5129352780.25,null,29.415939803301047,-38.659451116397605,null,38.95425013345637,-48.677839309948538,null,0,0]
[72031.75,72.031750000000002,32.057236751877035,1.5395970609775937,2.0594742810995745,1.0637917632631446,1,0,23762.772974463125,1.5707542441641629,10.956741015864186,1.479401126625596,1.1998517357529845,0.58549923030543027,1,0,1,0,0.95081397697337844,0.37397156276912963,10.376547438104325,-87.469410618516605,92.530589381483395,null,1000000000,5188573008.0625,null,29.400358268641039,-38.780782929295256,null,38.947036354287746,-48.688627689221306,null,0,0]
[72444,72.444000000000003,32.240527767224776,1.5397744893848415,2.0684881073760937,1.0662105430648763,1,0,23898.771379908267,1.5707544836396818,11.018927446336077,1.4799183534194287,1.2019529548406722,0.58813054513853624,1,0,1,0,0.9503152432034524,0.37642587841328828,10.353908343951211,-87.602754614468481,92.397245385531519,null,1000000000,5248133136,null,29.38474998660724,-38.901924972539675,null,38.940005542168429,-48.700829641928792,null,0,0]
[72865.75,72.865750000000006,32.428043628383854,1.5399539308955619,2.0777220639428302,1.0686633292609817,1,0,24037.903769228018,1.5707547258296091,11.08254993352781,1.4804414924719929,1.204111176526331,0.59081297427111423,1,0,1,0,0.94980370973762351,0.37894243751097462,10.330906121134744,-87.740421858757287,92.259578141242713,null,1000000000,5309417523.0625,null,29.368754740148542,-39.025657057470987,null,38.932998565810664,-48.714764801286329,null,0,0]
[73287.5,73.287499999999994,32.615560521695471,1.5401313090830198,2.0869684097608876,1.0710943957606727,1,0,24177.036158549163,1.5707549652320596,11.146175419105104,1.4809586592168029,1.2062780312657686,0.59348578560549003,1,0,1,0,0.94929088606220424,0.381464782280102,10.308061201023088,-87.879337793897363,92.120662206102637,null,1000000000,5371057656.25,null,29.352732304388795,-39.149180111474486,null,38.926176081458749,-48.730157682422906,null,0,0]
[73709.25,73.709249999999997,32.8030784294589,1.5403066593207513,2.0962269808852847,1.0735040014302515,1,0,24316.168547871675,1.5707552018948816,11.209803852012545,1.4814699550738237,1.2084534726196972,0.59614899279211209,1,0,1,0,0.94877680408870446,0.38399294832605091,10.285370553976536,-88.019486628653041,91.980513371346959,null,1000000000,5433053535.5625,null,29.336683087487785,-39.27248910846879,null,38.919534651313214,-48.746997520184266,null,0,0]
[74131,74.131,{"$f":"SQRT(1+(A525/pole1)^2)","v":32.990597334375785},{"$f":"ATAN(A525/pole1)","v":1.5404800161785428},{"$f":"SQRT(1+(A525/Zero1)^2)","v":2.1054976160398509},{"$f":"ATAN(A525/Zero1)","v":1.0758924015826941},{"$f":"IF(VIN_nom>Vout, 1, SQRT(1+(A525/z_RHP)^2))","v":1},{"$f":"IF(VIN_nom>Vout, 0, -ATAN(A525/z_RHP))","v":0},{"$f":"SQRT(1+(A525/Pole2)^2)","v":24455.300937195538},{"$f":"ATAN(A525/Pole2)","v":1.5707554358648341},11.273435182345024,1.4819754791856548,{"$f":"SQRT(1+(A525/pole4)^2)","v":1.2106374542992564},{"$f":"ATAN(A525/pole4)","v":0.59880260992845802},{"$f":"IF(VOUT_setting=1,1,SQRT(1+(A525*zterm1)^2))","v":1},{"$f":"IF(VOUT_setting=1,0,ATAN(((A525*zterm1))))","v":0},1,{"$f":"IF(VOUT_setting=1,0,ATAN(A525*$Q$4/(1+Afbr-$Q$5*(A525)^2)))","v":0},{"$f":"SQRT((1-(Z525/pterm2))^2+(A525/pterm1)^2)","v":0.94826149598909282},{"$f":"IF((ATAN((A525/pterm1)/(1-A525^2/pterm2))>0),ATAN((A525/pterm1)/(1-A525^2/pterm2)),PI()+ATAN((A525/pterm1)/(1-A525^2/pterm2)))","v":0.38652697122444457},{"$f":"20*LOG10(((E525*K525*G525*O525)/(C525*I525*S525*M525*Q525))*Adc)","v":10.262831218625379},{"$f":"((F525+L525+H525+P525)-(D525+J525+T525+N525+R525))*radconv","v":-88.160852883656801},{"$f":"IF(V525>0,V525,V525+180)","v":91.839147116343199},null,{"$f":"IF(U525<0,A525,1000000000)","v":1000000000},{"$f":"A525^2","v":5495405161},null,{"$f":"20*LOG10((K525/(I525*M525))*AEA)","v":29.320607498092119},{"$f":"(L525-(J525+N525))*radconv","v":-39.395579178406443},null,{"$f":"20*LOG10((E525*G525/(C525*S525))*Acs*Am)","v":38.913070905357714},{"$f":"(F525+H525-(D525+T525))*radconv","v":-48.765273705250351},null,{"$f":"SUM((U526<0)*(U525>0))*A525","v":0},0]
[74562.75,{"$f":"A526/1000","v":74.562749999999994},33.182563464498266,1.5406554538886756,2.1150003955781447,1.0783157296421833,1,0,24597.732256913747,1.5707556726406913,11.33857820827472,1.482487112180104,1.2128820180819821,0.60150922761435743,1,0,1,0,0.94773273334279706,0.38912718156584047,10.239911172807503,-88.306816257578731,91.693183742421269,null,1000000000,5559603687.5625,null,29.304123853856652,-39.521356103723377,null,38.906634503775308,-48.785460153855361,null,0,0]
[74994.5,74.994500000000002,33.374530604177764,1.5408288734019033,2.1245154843432394,1.0807173649330208,1,0,24740.16357663332,1.570755906690269,11.403724168374616,1.4829928997026003,1.2151354343074254,0.60420582638264397,1,0,{"$f":"IF(VOUT_setting=1,1,SQRT((1+Afbr-$Q$5*(A527)^2)^2+(A527*$Q$4)^2))","v":1},0,0.94720275480827532,0.39173360513614985,10.217143629259716,-88.454023616194206,91.545976383805794,null,1000000000,5624175030.25,null,29.28761343920884,-39.646893752013426,null,38.900377374875333,-48.807129864180766,null,0,0]
[75426.25,75.426249999999996,33.56649873609328,1.5410003093341478,2.1340427176851318,1.0830975701001004,1,0,24882.594896354236,1.5707561380603843,11.46887301264433,1.4834929411076057,1.2173976538176856,0.60689242276011246,1,0,1,0,0.94667159575628312,0.39434627998892474,10.194525620341164,-88.602459331719913,91.397540668280087,null,1000000000,5689119189.0625,null,29.271076693100589,-39.772187380283178,null,38.894296112065035,-48.830271951436785,null,0,0]
[75858,75.858000000000004,33.75846784331771,1.541169795514423,2.1435819336726945,1.0854566040933327,1,0,25025.026216076461,1.5707563667967879,11.534024692210986,1.4839873335163509,1.2196686276282394,0.60956903372874405,1,0,1,0,0.94613929184862788,0.39696524413388518,10.172054244874309,-88.752108094455892,91.247891905544108,null,1000000000,5754436164,null,29.254514054338703,-39.8972323995132,null,38.888387375360061,-48.854875694942677,null,0,0]
[76299.75,76.299750000000003,33.954884245169232,1.5413412237254085,2.1533543287744754,1.0878486308494475,1,0,25170.756466193136,1.5707565981517941,11.600688270517683,1.4844874290701402,1.2220012106025868,0.61229732233785816,1,0,1,0,0.9455935115206956,0.399651416631495,10.149211206338213,-88.906462830836531,91.093537169163469,null,1000000000,5821651850.0625,null,29.237541457352776,-40.024911713335001,null,38.882516933809896,-48.881551117501523,null,0,0]
[76741.5,76.741500000000002,34.151301633396344,1.541510680040997,2.1631389335555489,1.0902190311837543,1,0,25316.486716311141,1.5707568268432854,11.667354716950621,1.4849818097245679,1.224342854916288,0.61501519501447754,1,0,1,0,0.94504660915855088,0.402344253484686,10.126515732364323,-89.062056026112145,90.937943973887855,null,1000000000,5889257822.25,null,29.220542682652891,-40.15232152519043,null,38.876820234535892,-48.909734500921736,null,0,0]
[77183.25,77.183250000000001,34.347719991077263,1.541678198280382,2.1729355830774573,1.0925680707847429,1,0,25462.216966430457,1.5707570529169945,11.734023982624322,1.4854705726470065,1.2266935086775717,0.61772267136971748,1,0,1,0,0.94449862391408512,0.40504379524365325,10.103964918690355,-89.218872277479875,90.781127722520125,null,1000000000,5957254080.5625,null,29.203518198796509,-40.279457394053608,null,38.871293904718307,-48.939414883426274,null,0,0]
[77625,77.625,34.544139301675031,1.5418438114940087,2.1827441151616385,1.0948960115170063,1,0,25607.947216551052,1.5707572764176134,11.800696019756002,1.4859538128197842,1.2290531201927608,0.62041977147462612,1,0,1,0,0.94394959526369682,0.40775008239695465,10.081555925438479,-89.376896505138646,90.623103494861354,null,1000000000,6025640625,null,29.186468473544473,-40.406315030384974,null,38.865934636718471,-48.970581474753658,null,0,0]
[78077,78.076999999999998,34.745117132255622,1.5420113293071362,2.1927923692808262,1.097256398155237,1,0,25757.058870326015,1.5707575024863727,11.868917879394091,1.4864426460877138,1.2314767004000995,0.62316873407134099,1,0,1,0,0.9433867889252846,0.41052618813526154,10.058770870391829,-89.539822343386504,90.460177656613496,null,1000000000,6096017929,null,29.168997500846025,-40.53582385501187,null,38.860620554370264,-49.003998488374656,null,0,0]
[78529,78.528999999999996,34.946095926646336,1.5421769202985796,2.2028527288840811,1.0995952381010965,1,0,25906.170524102276,1.5707577259527028,{"$f":"SQRT(1+(A535/Zero2)^2)","v":11.937142542786267},{"$f":"ATAN(A535/Zero2)","v":1.4869258917868651},1.2339095500271429,0.62590687725475447,1,0,1,0,0.94282297486306033,0.41330944147743998,10.036128476067747,-89.703981933237827,90.296018066762173,null,1000000000,6166803841,null,29.151501089439009,-40.665032767919996,null,38.8554745714532,-49.038949165317824,null,0,0]
[78981,78.980999999999995,35.147075668313335,1.5423406175133194,2.2129250288702123,1.1019127998054703,1,0,26055.282177879821,1.570757946861284,12.005369962132624,1.4874036449533101,1.2363516143537687,0.62863422395808966,1,0,1,0,0.94225819642966346,0.41609988557185512,10.013625896870934,-89.869360130517933,90.130639869482067,null,1000000000,6237998361,null,29.133979736902699,-40.793937640480358,null,38.850493344792696,-49.075422490037575,null,0,0]
[79433,79.433000000000007,35.348056341098733,1.5425024532452034,2.2230091069360882,1.1042093477712016,1,0,26204.393831658617,1.5707581652557796,12.073600090711816,1.4878759984850154,1.2388028388848922,0.63135079757654788,1,0,1,0,0.94169249733953109,0.41889756348274693,9.9912603493964767,-90.035942118317294,89.964057881682706,null,1000000000,6309601489,null,29.116433939349506,-40.922534492979601,null,38.845673594871428,-49.113407625337665,null,0,0]
[79895.5,79.895499999999998,35.553706760041884,1.5426661545076952,2.2333394642692341,1.1065377649461487,1,0,26356.969362351701,1.570758386165741,12.143417967946696,1.4883538303126855,1.2413204308359824,0.6341193509373112,1,0,1,0,0.94111275000497263,0.42176776435938351,9.9685142515890206,-90.207624762565331,89.792375237434669,null,1000000000,6383290920.25,null,29.098455763794636,-41.05379582622399,null,38.840905672618845,-49.153828936341377,null,0,{"$f":"IF(AH538>0,W538,0)","v":0}]
[80358,80.358000000000004,35.759358120798218,1.5428279728890408,2.243681818177186,1.1088447286416827,1,0,26509.544893046052,1.5707586045328106,12.213238586106108,1.4888261989110911,1.2438474988106374,0.63687667587523999,1,0,1,0,0.94053213251076151,0.42464562997563932,9.9459059208408291,-90.380537409772742,89.619462590227258,null,1000000000,6457408164,null,29.080453039968575,-41.184726692511404,null,38.836300065696719,-49.195810717261367,null,0,0]
[80820.5,80.820499999999996,35.965010407211629,1.5429879406803204,2.2540360035257341,1.1111305097792834,1,0,26662.12042374165,1.5707588204006435,12.283061898449333,1.4892931972351224,1.2463839851703877,0.63962279888826035,1,0,1,0,0.93995069287539512,0.42753120616432899,9.9234325648239423,-90.554665208249233,89.445334791750767,null,1000000000,6531953220.25,null,29.06242629375328,-41.315323286639533,null,38.831853455895121,-49.239341921609686,null,0,0]
[81283,81.283000000000001,36.170663603493331,1.5431460894386155,2.2644018580138408,1.1133953752135086,1,0,26814.695954438484,1.5707590338119022,12.352887859290655,1.4897549161474135,1.2489298325310534,0.64235774693524539,1,0,1,0,0.93936847952066727,0.43042453864589786,9.9010914510849304,-90.729993637059508,89.270006362940492,null,1000000000,6606926089,null,29.044376048874877,-41.44558194963696,null,38.827562587034514,-49.284411687422569,null,0,0]
[81756.25,81.756249999999994,36.381097772780812,1.5433060633129352,2.2750205613222394,1.1156915070605795,1,0,26970.817835309514,1.5707592496841343,12.424339496896055,1.4902219946510151,1.2515444839487977,0.6451447250407063,1,0,1,0,0.93877198367166137,0.43339319793822828,9.8783651564186883,-90.910625273965266,89.089374726034734,null,1000000000,6684084414.0625,null,29.025882477412985,-41.578514774437267,null,38.823329863830168,-49.332110499528028,null,0,0]
[82229.5,82.229500000000002,36.591532862411484,1.5434641971963818,2.2856511475586272,1.1179662921439251,1,0,27126.939716181791,1.5707594630715762,12.495793814026111,1.4906837314928336,1.2541688158453961,0.6479200611971937,1,0,1,0,0.93817478159425527,0.43637007474681849,9.8557717182412041,-91.092484273394916,88.907515726605084,null,1000000000,6761690670.25,null,29.007365404248592,-41.711086477003484,null,38.819253498817076,-49.381397796391433,null,0,0]
[82702.75,82.702749999999995,36.801968856597682,1.5436205226445321,2.2962934516885825,1.1202200035548433,1,0,27283.061597055286,1.5707596740168839,12.567250764975453,1.4911402175917947,1.2568027675793794,0.65068378571318197,1,0,1,0,0.93757692648789892,0.43935521765386398,9.833308391312741,-91.275556109646516,88.724443890353484,null,1000000000,6839744857.5625,null,28.988825382700412,-41.843293587056486,null,38.815330193436786,-49.432262522590086,null,0,0]
[83176,83.176000000000002,37.01240573991069,1.5437750704956739,2.3069473115427561,1.1224529102045613,1,0,27439.183477929986,1.5707598825617428,12.638710305070688,1.4915915418194607,1.2594462787952074,0.65343592935360273,1,0,1,0,0.93697847200142848,0.44234867509389236,9.8109724878249711,-91.459826590363363,88.540173409636637,null,1000000000,6918246976,null,28.97026296322413,-41.975132777720006,null,38.811556709425304,-49.484693812643364,null,0,0]
[83660.5,83.660499999999999,37.227845990130902,1.5439314822094785,2.3178662373839045,1.1247176210194685,1,0,27599.016655498646,1.5707600936198998,12.711871203012473,1.4920483381471259,1.2621624713403723,0.65624153187190071,1,0,1,0,0.93636522674940359,0.44542195614813057,9.7882348748101418,-91.649704758160382,88.350295241839618,null,1000000000,6999079260.25,null,28.951236650514591,-42.109721552232884,null,38.80784540912002,-49.539983205927506,null,0,0]
[84145,84.144999999999996,37.443287140635682,1.5440860940038843,2.3287969398499957,1.1269610834498156,1,0,27758.849833068522,1.5707603022475458,12.785034723092449,1.4924999064513389,1.2648885561642906,0.65903506304460713,1,0,1,0,0.93575146852892599,0.44850405397026044,9.76562529043008,-91.84081017178525,88.15918982821475,null,1000000000,7080381025,null,28.932188020269841,-42.243918094010866,null,38.804284454984696,-49.596892077774385,null,0,0]
[84629.5,84.629499999999993,37.658729175973775,1.5442389367629425,2.3397392538883066,1.1291835728713706,1,0,27918.683010639594,1.5707605084864245,12.858200820550499,1.4929463357922874,1.2676244694455605,0.66181655729172972,1,0,1,0,0.93513725638199785,0.45159502000735935,9.7431410253341504,-92.033128642334873,87.966871357665127,null,1000000000,7162152270.25,null,28.913117653118313,-42.37771927479394,null,38.800870557040298,-49.655409367540891,null,0,0]
[85114,85.114000000000004,37.874172081045423,1.5443900406683171,2.3506930173456362,1.131385360364066,1,0,28078.516188211837,1.5707607123773288,12.931369451637963,1.4933877132227689,1.2703701476834621,0.66458604948231004,1,0,1,0,0.93452264985212052,0.45469490551451797,9.7207794251394422,-92.226646316483809,87.773353683516191,null,1000000000,7244392996,null,28.894026126093326,-42.511122107010458,null,38.797600483870575,-49.715524209473308,null,0,0]
[85609.5,85.609499999999997,38.094507246901763,1.5445428074278533,2.3619071493371284,1.133616002633685,1,0,28241.978189218287,1.5707609185103384,13.006201866040909,1.493833975023795,1.273188197488351,0.66740604262749548,1,0,1,0,0.93389374407197634,0.45787444899263535,9.6980342945667193,-92.425783839974187,87.574216160025813,null,1000000000,7328986490.25,null,28.874479860043515,-42.647138705435594,null,38.794401619347667,-49.778645134538579,null,0,0]
[86105,86.105000000000004,38.31484329157054,1.5446938171682401,2.3731329225195976,1.135825552328851,1,0,28405.440190225927,1.5707611222709212,13.081036840988215,1.4942751308959947,1.2760163273780285,0.67021355769570012,1,0,1,0,0.93326455338111469,0.4610634293366645,9.6754120143478577,-92.626147372862732,87.373852627137268,null,1000000000,7414071025,null,28.854912671236264,-42.782732774955008,null,38.791346527936057,-49.843414597907724,null,0,0]
[86600.5,86.600499999999997,38.535180199977162,1.5448431000214451,2.3843701724705482,1.1380142859417981,1,0,28568.902191234731,1.5707613236998001,13.155874332784208,1.4947112678017505,1.2788544704775162,0.67300863335919969,1,0,1,0,0.93263514311144202,0.46426190069710055,9.6529099114135146,-92.827723137854747,87.172276862145253,null,1000000000,7499646600.25,null,28.835325164622333,-42.917901551082664,null,38.788431931615641,-49.90982158677209,null,0,0]
[87096,87.096000000000004,38.755517957389777,1.5449906854345075,2.3956187376860103,1.1401824755774492,1,0,28732.36419224468,1.5707615228367708,13.230714298720384,1.4951424707435588,1.2817025602684444,0.67579130872580062,1,0,1,0,0.93200557915178472,0.46746991697842849,9.6305253648364619,-93.03049769288512,86.96950230711488,null,1000000000,7585713216,null,28.815717940824168,-43.052642406526601,null,38.785654608836751,-49.977855286358526,null,0,0]
[87603.25,87.603250000000003,38.981081541172315,1.5451400423519461,2.4071456001779055,1.1423810794613547,1,0,28899.702436468444,1.5707617243624876,13.307331495520026,1.4955788748746535,1.2846284222322615,0.67862716725382632,1,0,1,0,0.931360996254604,0.47076394942835165,9.6077290914390652,-93.239308804376222,86.760691195623778,null,1000000000,7674329410.5625,null,28.795625961045079,-43.190132563334984,null,38.782950315218443,-50.049176241041216,null,0,0]
[88110.5,88.110500000000002,39.206645984519263,1.5452876807063629,2.4186839875328507,1.1445587168077946,1,0,29067.040680693372,1.5707619235678469,13.383951197665382,1.4960102824827541,1.2875645682969452,0.68145011468587446,1,0,1,0,0.93071639382764992,0.47406809834305358,9.585050616736142,-93.44934876972863,86.55065123027137,null,1000000000,7763460210.25,null,28.775514577432993,-43.327169115567564,null,38.780383224127611,-50.122179654161059,null,0,0]
[88617.75,88.617750000000001,39.432211272679695,1.5454336299835125,2.4302337355958588,1.1467156657473729,1,0,29234.378924919431,1.5707621204926945,13.460573362373983,1.4964367787316215,1.2905109282679219,0.68426019430816287,1,0,1,0,0.93007184438591772,0.47738242068875852,9.5624872867247284,-93.660604209442624,86.339395790557376,null,1000000000,7853105615.0625,null,28.755384419731968,-43.46374966610086,null,38.777950051817228,-50.196854543341779,null,0,0]
[89125,89.125,39.657777391238241,1.5455779189986025,2.44179468315766,1.148852199921133,1,0,29401.717169146621,1.5707623151759684,13.537197947830622,1.4968584468640465,1.2934674323471207,0.68705744982608752,1,0,1,0,0.92942742106474729,0.48070697311790067,9.5400364967919806,-93.873062078881631,86.126937921118369,null,1000000000,7943265625,null,28.735236112593057,-43.599871951840001,null,38.775647569023384,-50.273190127041659,null,0,0]
[89644,89.644000000000005,39.888569395273556,1.545723861317511,2.4536348564250248,1.1510173762350473,1,0,29572.931656587698,1.570762512088536,13.615599937281173,1.4972849702616382,1.2965028481582852,0.68990627418319905,1,0,1,0,0.92876827771445203,0.48411918291117373,9.5171794679244144,-94.091672617286051,85.908327382713949,null,1000000000,8036046736,null,28.714602948811109,-43.738670855948634,null,38.773423703937773,-50.353001761337431,null,0,0]
[90163,90.162999999999997,40.119362239127106,1.5458681245278849,2.4654864217934738,1.1531617465652482,1,0,29744.14614402991,1.570762706734151,13.694004375348676,1.4977066096521576,1.2995487369236891,0.69274176728566217,1,0,1,0,0.9281094232919499,0.48754222115172952,9.494434887286701,-94.311515347721439,85.688484652278561,null,1000000000,8129366569,null,28.693952091393335,-43.87698563853526,null,38.771329980717823,-50.43452970918618,null,0,0]
[90682,90.682000000000002,40.350155908388246,1.5460107374360181,2.4773492157645887,1.1552855899366039,1,0,29915.360631473235,1.5707628991517368,13.772411220214215,1.498123448298889,1.3026050251764281,0.6955639772158998,1,0,1,0,0.92745093816346857,0.4909761474240904,9.4718001138173804,-94.532577334176509,85.467422665823491,null,1000000000,8223225124,null,28.67328419241527,-44.014814286115211,null,38.769363106226578,-50.517763048061248,null,0,0]
[91201,91.200999999999993,40.580950388974081,1.5461517281931614,2.4892230778032252,1.1573891807983743,1,0,30086.575118917659,1.5707630893793307,13.85082043100452,1.4985355675864696,1.3056716398878121,0.698372952453298,1,0,1,0,0.92679290338396636,0.49442102091625401,9.449272552848841,-94.754845972884496,85.245154027115504,null,1000000000,8317622401,null,28.652599898091751,-44.152154915535789,null,38.767519839581553,-50.602691057348693,null,0,0]
[91732,91.731999999999999,40.81708198345504,1.5462943287001025,2.5013827705098013,1.1595207307953677,1,0,30261.748322835894,1.5707632817774868,13.931044978472629,1.4989524143088238,1.3088197706444167,0.70123322881870442,1,0,1,0,0.92612020527483963,0.49795693577901085,9.4263324236553174,-94.983489789741,85.016510210259,null,1000000000,8414759824,null,28.6314210535831,-44.292164145382159,null,38.765758554896678,-50.691325644358827,null,0,0]
[92263,92.263000000000005,41.05321439839927,1.5464352887730706,2.513553718272298,1.1616316478320827,1,0,30436.921526755243,1.5707634719610297,14.011271918895257,1.4993644874687906,1.3119785576545193,0.70407975528205469,1,0,1,0,0.92544815245203615,0.50150443395845778,9.4034991682354416,-95.21337104009109,84.78662895990891,null,1000000000,8512461169,null,28.610226396302775,-44.431658941961459,null,38.764119956757128,-50.781712098129653,null,0,0]
[92794,92.793999999999997,41.289347619730151,1.5465746365512745,2.5257357583840352,1.1637222115075707,1,0,30612.094730675675,1.5707636599679782,14.091501211401086,1.4997718684593691,1.3151479241339799,0.70691258495560405,1,0,1,0,0.9247768339756619,0.50506357746258779,9.3807701470056379,-95.444477250954492,84.555522749045508,null,1000000000,8610726436,null,28.589016598939764,-44.570637687084727,null,38.762600732890334,-50.873839563869765,null,0,0]
[93325,93.325000000000003,41.525481633691236,1.5467123995341241,2.5379287311154215,1.1657926967667562,1,0,30787.267934597181,1.5707638458354851,14.171732816043136,1.500174636836682,1.3183277937811044,0.70973177132105159,1,0,1,0,0.92410633966928968,0.50863442780151624,9.3581427636449348,-95.676796277191727,84.323203722808273,null,1000000000,8709555625,null,28.567792327545828,-44.709098888926242,null,38.761197620923568,-50.967697388265499,null,0,0]
[93868.5,93.868499999999997,41.767175164769029,1.5468517923791765,2.55041989042856,1.1678914114687422,1,0,30966.564801512275,1.5707640339007192,14.253855465613166,1.5005821909723582,1.3215933169388172,0.71260325006107472,1,0,1,0,0.92342100965281981,0.51230152481989877,9.3350853092896067,-95.915827842784878,84.084172157215122,null,1000000000,8811295292.25,null,28.546054125437301,-44.850282145299261,null,38.759878368676766,-51.065545697485611,null,0,0]
[94412,94.412000000000006,42.008869498059944,1.5469895812579497,2.5629221738006915,1.1699696596181177,1,0,31145.861668428453,1.5707642198006893,14.335980455628761,1.5009850757511922,1.3248696833789371,0.71546055008723386,1,0,1,0,0.92273673594424099,0.5159810150568187,9.3121289616361125,-96.156105263999962,83.843894736000038,null,1000000000,8913625744,null,28.524302150340723,-44.990920431587945,null,38.758673996119846,-51.165184832412017,null,0,0]
[94955.5,94.955500000000001,42.250564619796783,1.5471257936917207,2.5754354192287634,1.1720277214526635,1,0,31325.158535345694,1.5707644035725754,14.418107746096657,1.5013833708329327,1.3281568128551442,0.71830372984722335,1,0,1,0,0.92205361735884661,0.51967296273759389,9.2892710661831543,-96.39761652785667,83.60238347214333,null,1000000000,9016546980.25,null,28.502537094612745,-45.131012534561364,null,38.757581156394863,-51.266603993295305,null,0,0]
[95499,95.498999999999995,42.492260516525562,1.5472604565758397,2.5879594677022948,1.1740658724766415,1,0,31504.455402263982,1.5707645852527117,14.500237297928546,1.5017771540784537,1.3314546256512587,0.72113284812565503,1,0,1,0,0.92137175355820045,0.52337743146478943,9.2665090085031867,-96.640349943364555,83.359650056635445,null,1000000000,9120059001,null,28.480759643177052,-45.27055736331198,null,38.75659655015059,-51.369792580052589,null,0,0]
[96611.5,96.611500000000007,42.986994589602432,1.5475313782940123,2.613628204240301,1.1781768453525794,1,0,31871.461408608651,1.5707649507626733,14.668356658068905,1.5025694447544147,1.3382379607287844,0.72688022130287211,1,0,1,0,0.91998037084550943,0.53099948533782404,9.2202050040588972,-97.140968994267851,82.859031005732149,null,1000000000,9333781932.25,null,28.436147170047668,-45.554483620275704,null,38.754905018835693,-51.586485373992154,null,0,0]
[97724,97.724000000000004,43.481731746064206,1.5477961349115514,2.6393402517643771,1.1822077883176798,1,0,32238.467414957478,1.5707653079506294,14.83648501721953,1.5033437792914142,1.3450650541715417,0.73256943739701308,1,0,1,0,0.91859554071009653,0.53867479502289295,9.1742701707236414,-97.646567699074126,82.353432300925874,null,1000000000,9549980176,null,28.391491303017805,-45.836106055990783,null,38.753626052530301,-51.810461643083357,null,0,0]
[98862,98.861999999999995,43.987812026956718,1.5480607982513888,2.6656851589522859,1.1862506032076878,1,0,32613.885693815544,1.5707656650083943,15.00847610053505,1.5041179125670967,1.3520932170889788,0.73832942358317621,1,0,1,0,0.91718667395864317,0.54658167474587305,9.1276424820763893,-98.168815185676124,81.831184814323876,null,1000000000,9773695044,null,28.345772783399305,-46.12179484326375,null,38.752716883501542,-52.047020342412402,null,0,0]
[100000,100,44.493895318957364,1.5483194409316323,2.6920727818871582,1.1902142267077087,1,0,32989.303972677677,1.5707660139395245,15.180475974355202,1.5048745039094231,1.3591657742100249,0.74402965191015624,1,0,1,0,0.91578655977389889,0.55454536337111582,9.0813571365294443,-98.696090696657762,81.303909303342238,null,1000000000,10000000000,null,28.300020527281156,-46.405064370533964,null,38.752183794072749,-52.29102632612382,null,0,0]
[101165,101.16500000000001,45.011988872615667,1.5485781954922506,2.7191294227691527,1.1941921375135331,1,0,33373.629363608256,1.5707663630175306,15.35656548620199,1.5056314893604474,1.366451400551379,0.7498038066831676,1,0,1,0,0.91436331997404463,0.56275739250638324,9.0343059113240702,-99.240995979718519,80.759004020281481,null,1000000000,10234357225,null,28.253153750058829,-46.692546998811281,null,38.751999346089704,-52.54844898090721,null,0,0]
[102330,102.33,45.530085371415723,1.5488310612234208,2.7462282423221622,1.1980916037491514,1,0,33757.954754542814,1.5707667041472151,15.532663598251986,1.5063713109197259,1.3737821014558169,0.7555165267798265,1,0,1,0,0.91295135647993042,0.57103005529400597,8.9875685950786082,-99.790995468367413,80.209004531632587,null,1000000000,10471428900,null,28.206263519893518,-46.977492642566759,null,38.752152260009552,-52.813502825800668,null,0,0]
[103520,103.52,46.059302758113489,1.5490834801156379,2.7739508423250316,1.2019960308785473,1,0,34150.527471467052,1.5707670446703093,15.712549218089411,1.5071098873835935,1.3813159031508324,0.76128904363420402,1,0,1,0,0.9115218697845674,0.57954339061063742,8.9401295804477314,-100.35797204273332,79.642027957266677,null,1000000000,10716390400,null,28.158348865279219,-47.265935692129126,null,38.752627899992973,-53.092036350604204,null,0,0]
[104710,104.71,46.588523012820893,1.5493301643409212,2.8017148927307267,1.2058231322771442,1,0,34543.100188395169,1.5707673774535031,15.892443215012216,1.5078317436490491,1.3888952327554072,0.76699874670943058,1,0,1,0,0.91010646933334194,0.58812108040537947,8.8929722252650443,-100.93009631180139,79.069903688198607,null,1000000000,10964184100,null,28.110421778118116,-47.551737330585865,null,38.753397631971389,-53.378358981215506,null,0,0]
[105930,105.93,47.131087830858036,1.5495773163490014,2.8302206311693117,1.209668707550154,1,0,34945.569696510218,1.5707677108642129,16.076880756857008,1.508555026986611,1.3967121259801063,0.77278786691850565,1,0,1,0,0.90867126844554769,0.5969823644354959,8.8448948414369823,-101.52190619795383,78.478093802046175,null,1000000000,11221164900,null,28.061279641791455,-47.842007506383524,null,38.754462384469988,-53.679898691570259,null,0,0]
[107150,107.15,47.67365546232606,1.5498188427622617,2.8587673891327672,1.2134375362086496,1,0,35348.039204629073,1.5707680366825556,16.261326518355112,1.5092619028563403,1.4045753065678819,0.77851235917283834,1,0,1,0,0.9072534533152532,0.60591236316764163,8.7970659350143148,-102.11896481539557,77.881035184604428,null,1000000000,11481122500,null,28.01213666766602,-48.129514416781454,null,38.755776452172753,-53.989450398614103,null,0,0]
[108400,108.4,48.229567739564104,1.5500606720566088,2.8880573895487398,1.2172217098634746,1,0,35760.40550393497,1.5707683629061755,16.450316067571968,1.5099697196833708,1.4126790444633293,0.78431132590430097,1,0,1,0,0.9058202059368653,0.61513374728716042,8.7482940344925062,-102.73606991960969,77.26393008039031,null,1000000000,11750560000,null,27.961790578992186,-48.421234510743787,null,38.75735064032478,-54.314835408865946,null,0,0]
[109650,109.65,48.785482773054902,1.5502969900307071,2.9173879160890426,1.2209298458821358,1,0,36172.771803244592,1.5707686816919566,16.639313671253131,1.5106614573790336,1.4208297451267513,0.79004395112841774,1,0,1,0,0.90440807823382785,0.62442830218800205,8.699733341379261,-103.35852801286144,76.641471987138559,null,1000000000,12023122500,null,27.911455994004868,-48.710074356534207,null,38.759124532198854,-54.648453656327213,null,0,0]
[110925,110.925,49.35251885011391,1.5505325497201579,2.9473455484290172,1.2246360607175963,1,0,36593.385428544112,1.5707689994517604,16.832099243343507,1.5113510261387288,1.4291910075511403,0.79582367365477436,1,0,1,0,0.90299100751244921,0.63398461903436121,8.6503934598953087,-103.9988732787655,76.001126721234499,null,1000000000,12304355625,null,27.860132763667647,-49.001736891065441,null,38.761107881052126,-54.997136387700074,null,0,0]
[112200,112.2,49.919557603450507,1.550762757953537,2.9773428505647068,1.2282676429475243,1,0,37013.999053847241,1.5707693099897504,17.024892637915446,1.5120249775752383,1.4375994561004011,0.80153597452461578,1,0,1,0,0.90159905963295872,0.64361801733253432,8.6012218006508618,-104.64463592056772,75.355364079432277,null,1000000000,12588840000,null,27.808833851358088,-49.290430842153576,null,38.763235134117231,-55.354205078414125,null,0,0]
[113510,113.51,50.502164819219267,1.550993901243841,3.0082036788817765,1.2319234294387038,1,0,37446.158935534862,1.5707696217861975,17.222986271599538,1.5127017139837227,1.4462870065982867,0.80733570815867162,1,0,1,0,0.90019677969294154,0.65359658840496693,8.5508486052444042,-105.31369231170852,74.686307688291478,null,1000000000,12884520100,null,27.756158292720762,-49.583974826591977,null,38.765537497348106,-55.729717485116566,null,0,0]
[114820,114.82,51.084774671634072,1.5512197722761498,3.0391038943452111,1.235504922265438,1,0,37878.318817226056,1.5707699264679724,17.421087613550405,1.5133630598718009,1.455022623838633,0.81306599212023944,1,0,1,0,0.89882453301252707,0.6636573834331958,8.5005983668657095,-105.98831665488437,74.011683345115628,null,1000000000,13183632400,null,27.703520873428435,-49.874421042127786,null,38.767924678261735,-56.113895612756579,null,0,0]
[116155,116.155,51.678505652958307,1.5514447142774224,3.0706330992709345,1.2390805587804239,1,0,38318.72602490725,1.570770229893881,17.622977176651407,1.5140217297515566,1.4639735118896973,0.8188350834153566,1,0,1,0,0.89745888206955338,0.67399514053283693,8.4494873095970373,-106.68146881670128,73.318531183298717,null,1000000000,13491984025,null,27.649924361750145,-50.167244006119816,null,38.770410132671351,-56.514224810581453,null,0,0]
[117490,117.49,52.272239189756419,1.5516645462881218,3.1022007644845124,1.2425834687305151,1,0,38759.133232591892,1.5707705264243335,17.824874212215072,1.5146654787906721,1.4729725314003124,0.82453387076304507,1,0,1,0,0.89612826830247105,0.68441898115964683,8.3984467140070844,-107.3802537322949,72.619746267705096,null,1000000000,13803900100,null,27.596379787951019,-50.456893356752381,null,38.772914110880528,-56.923360375542529,null,0,0]
[118860,118.86,52.881541340911745,1.5518850094722694,3.1346348137619988,1.2461048192561708,1,0,39211.086696661245,1.5707708238036675,18.032071934143055,1.515311117473751,1.4822566016581029,0.83030993005609888,1,0,1,0,0.89480127784048413,0.695205876613048,8.3461111777007861,-108.10313888999238,71.89686111000762,null,1000000000,14127699600,null,27.541491589015905,-50.750861843747558,null,38.775466773509343,-57.352277046244787,null,0,0]
[120230,120.23,{"$f":"SQRT(1+(A589/pole1)^2)","v":53.490846003767864},{"$f":"ATAN(A589/pole1)","v":1.5521004501532651},{"$f":"SQRT(1+(A589/Zero1)^2)","v":3.1671069358382873},{"$f":"ATAN(A589/Zero1)","v":1.2495540035111243},{"$f":"IF(VIN_nom>Vout, 1, SQRT(1+(A589/z_RHP)^2))","v":1},{"$f":"IF(VIN_nom>Vout, 0, -ATAN(A589/z_RHP))","v":0},{"$f":"SQRT(1+(A589/Pole2)^2)","v":39663.040160733981},{"$f":"ATAN(A589/Pole2)","v":1.5707711144058298},18.239277001947901,1.5159420870168567,{"$f":"SQRT(1+(A589/pole4)^2)","v":1.4915895076712256},{"$f":"ATAN(A589/pole4)","v":0.83601389583291952},{"$f":"IF(VOUT_setting=1,1,SQRT(1+(A589*zterm1)^2))","v":1},{"$f":"IF(VOUT_setting=1,0,ATAN(((A589*zterm1))))","v":0},1,{"$f":"IF(VOUT_setting=1,0,ATAN(A589*$Q$4/(1+Afbr-$Q$5*(A589)^2)))","v":0},{"$f":"SQRT((1-(Z589/pterm2))^2+(A589/pterm1)^2)","v":0.89351545071711513},{"$f":"IF((ATAN((A589/pterm1)/(1-A589^2/pterm2))>0),ATAN((A589/pterm1)/(1-A589^2/pterm2)),PI()+ATAN((A589/pterm1)/(1-A589^2/pterm2)))","v":0.7060839134705158},{"$f":"20*LOG10(((E589*K589*G589*O589)/(C589*I589*S589*M589*Q589))*Adc)","v":8.2937888218723206},{"$f":"((F589+L589+H589+P589)-(D589+J589+T589+N589+R589))*radconv","v":-108.83180255728533},{"$f":"IF(V589>0,V589,V589+180)","v":71.168197442714671},null,{"$f":"IF(U589<0,A589,1000000000)","v":1000000000},{"$f":"A589^2","v":14455252900},null,{"$f":"20*LOG10((K589/(I589*M589))*AEA)","v":27.486670393437397},{"$f":"(L589-(J589+N589))*radconv","v":-51.041539768034752},null,{"$f":"20*LOG10((E589*G589/(C589*S589))*Acs*Am)","v":38.777965613259383},{"$f":"(F589+H589-(D589+T589))*radconv","v":-57.79026278925059},null,{"$f":"SUM((U590<0)*(U589>0))*A589","v":0},0]
[126030,{"$f":"A590/1000","v":126.03},56.070409933183512,1.5529606622857992,3.3049760809646984,1.2634041854096822,1,0,41576.419789690066,1.5707722746998591,19.116571418854623,1.5184618046838703,1.5316214643125665,0.85938576632127672,1,0,1,0,0.88857913205746275,0.75314834058235813,8.0717179615074475,-111.97893198637109,68.021068013628906,null,1000000000,15883560900,null,27.255453817874852,-52.236346599775686,null,38.787111328457058,-59.742585386595401,null,0,0]
[131830,131.83000000000001,58.650011703052897,1.5537452055863272,3.4434283767647442,1.2761428825144157,1,0,43489.799418697206,1.5707733328971676,19.993976555022499,1.5207603879700717,1.5724472034087038,0.8815556163786914,1,0,{"$f":"IF(VOUT_setting=1,1,SQRT((1+Afbr-$Q$5*(A591)^2)^2+(A591*$Q$4)^2))","v":1},0,0.88459373028541266,0.80184110613082127,7.8470148605856096,-115.22249973800189,64.777500261998114,null,1000000000,17379148900,null,27.025938428943974,-53.374946950885459,null,38.7919236164661,-61.847552787116406,null,0,0]
[144540,144.54,64.303007720917861,1.5552443277926631,3.7485529542254672,1.3007567209687525,1,0,47682.739950687173,1.5707753548456942,21.917026210901728,1.5251538531911211,1.6644005583751833,0.9262736893681357,1,0,1,0,0.88007721988876542,0.91402306734462757,7.3342020436631401,-122.6362226606382,57.363777339361803,null,1000000000,20891811600,null,26.53047582597371,-55.685492638292104,null,38.774573402513887,-66.950730022346107,null,0,0]
[158490,158.49,70.507653918226907,1.5566129938794544,4.0856495251958478,1.3235250740793756,1,0,52284.747851838438,1.5707772007583152,24.028095688460805,1.5291663568721741,1.7687337384827599,0.96990702473388157,1,0,1,0,0.88373645776106324,1.0447636000477756,6.7163979140731165,-131.17120385554057,48.828796144459432,null,1000000000,25119080100,null,26.000861897100368,-57.95570484021983,null,38.686383201797213,-73.215499015320717,null,0,0]
[173780,173.78,77.308428167569588,1.5578607657911221,4.4571732181487622,1.3445127038261395,1,0,57328.812426102035,1.5707788835589787,26.342318632557742,1.5328254726720898,1.8865041976901988,1.0121002592311064,1,0,1,0,0.90107552481046194,1.1943847825852103,5.9426140078193885,-140.82079439556676,39.179205604433236,null,1000000000,30199488400,null,25.439689946875383,-60.163643628730505,null,38.473771245768461,-80.657150766836253,null,0,0]
[190550,190.55,84.767600460919795,1.5589990930555153,4.8665542524845495,1.3638378888282443,1,0,62861.118699010767,1.5707804187102055,28.880884878512909,1.5361644265974723,2.0190596684343554,1.0526391438043909,1,0,1,0,0.9395128712141666,1.3607225384949502,4.9520825806373736,-151.44070258602179,28.559297413978214,null,1000000000,36309302500,null,24.848809123374789,-62.295130613156452,null,38.074120642087045,-89.145571972865341,null,0,0]
[208930,208.93,92.942993819824125,1.5600368359112708,5.3169880501627071,1.381593094964815,1,0,68924.55276570344,1.5707818181769961,31.663473276913429,1.5392089420369059,2.167660096204679,1.0913061100533876,1,0,1,0,1.0080398145589178,1.5377382781352811,3.6920140236988126,-162.66621356831175,17.333786431688253,null,1000000000,43651744900,null,24.231092656079099,-64.336226886329769,null,37.431768552444169,-98.329986681982035,null,0,0]
[229090,229.09,101.91022395048687,1.5609836111551241,5.8126578017276751,1.3978978386722187,1,0,75575.196442901346,1.5707830949404378,34.715820544718291,1.541987031005349,2.3338776831951353,1.1279959144988518,1,0,1,0,1.1165527472197572,1.7166134871841916,2.1356752424302279,-173.97813267044242,6.0218673295575798,null,1000000000,52482228100,null,23.588625575641046,-66.279298214588465,null,36.517896851613642,-107.6988344558539,null,0,0]
[251190,251.19,111.74045936287914,1.5618468974249,6.3575109548753685,1.4128461185617538,1,0,82865.832616931453,1.5707842590949961,38.062151767096211,1.5445204849726468,2.5191980335185788,1.1626030193051105,1,0,1,0,1.2747632132104956,1.8877343634060151,0.2987723936675668,-184.81337751582518,-4.8133775158251808,null,1000000000,63096416100,null,22.924334992283807,-68.117049744479999,null,35.345284586208223,-116.69632777134522,null,251190,-4.8133775158251808]
[275420,275.42,122.51821335859451,1.5626341843990761,6.9562413899890503,1.426540735043248,1,0,90859.140965308034,1.5707853207476306,{"$f":"SQRT(1+(A599/Zero2)^2)","v":41.731236249737769},{"$f":"ATAN(A599/Zero2)","v":1.5468311674138862},2.7253501693216755,1.1950946803464486,1,0,1,0,1.4920098973126499,2.0439179257783771,-1.7698290861371282,-194.75180449845769,-14.751804498457687,null,275420,75856176400,null,22.240630662558502,-69.846353270031585,null,33.960387436128826,-124.90545122842607,null,0,0]
[302000,302,134.34134425059105,1.5633525332207843,7.6142939510306196,1.4390838882907009,1,0,99627.697956732838,1.5707862894255653,45.756388167217274,1.5489397147877555,2.954319404010036,1.2254873453673236,1,0,1,0,1.7778194109426113,2.1816802688626051,-4.0083510747905589,-203.58811002553364,-23.588110025533638,null,302000,91204000000,null,21.539508265553398,-71.466969341465685,null,32.422987844480502,-132.12114068406797,null,0,0]
[331130,331.13,147.29881464632797,1.5640073537530235,8.3366260802670507,1.4505541860778597,1,0,109237.48219911728,1.5707871724279168,50.167894609007583,1.5508619396568692,3.2079188471749629,1.2537846015912228,1,0,1,0,2.1422640030824374,2.3005205755117681,-6.3563030272454473,-211.28870541470621,-31.288705414706214,null,331130,109647076900,null,20.82384081490428,-72.978197916654992,null,30.790703342674732,-138.31050749805124,null,0,0]
[363080,363.08,161.51072466680341,1.5646047479299861,9.1299372309543454,1.4610463571497807,1,0,119777.56481314254,1.5707879779859892,55.00664489465877,1.5526157034680779,3.488570714172516,1.2800677062105323,1,0,1,0,2.5979407529562577,2.4020817779540451,-8.7706944558850868,-217.94627858684512,-37.946278586845125,null,363080,131827086400,null,20.095067325992403,-74.383671775880899,null,29.105085402946962,-143.56260681096418,null,0,{"$f":"IF(AH602>0,W602,0)","v":0}]
[398110,398.11,177.09272680755166,1.5651495374974567,10.00068699157349,1.4706358096817402,1,0,131333.71798909493,1.5707887126039994,60.312015467856988,1.5542151229264385,3.7986170859504549,1.3044030035781888,1,0,1,0,3.1598642288207635,2.4886340523886838,-11.220025603578481,-223.68984954902635,-43.689849549026349,null,398110,158491572100,null,19.355266105776629,-75.686383715608372,null,27.395555475469351,-148.00346583341801,null,0,0]
[436520,436.52,194.17826670027142,1.5656463971075891,10.956335133086682,1.4793977313864735,1,0,144004.90963884385,1.5707893825872128,66.129441985889869,1.5556738928887073,4.1407582799856506,1.3268833082550955,1,0,1,0,3.8468006030957032,2.5625805005041027,-13.685227198591321,-228.65759937151222,-48.657599371512219,null,436520,190549710400,null,18.605978002655956,-76.890867322231657,null,25.679641983577181,-151.76673204928053,null,0,0]
[478630,478.63,212.90968676751146,1.5660994823632666,12.004845210970423,1.487399991250393,1,0,157896.70553505054,1.5707899935405287,72.50739036592698,1.5570041919588855,4.5178798222732315,1.3476051556601314,1,0,1,0,4.6816567281433139,2.6260672785624992,-16.154558881213767,-232.97367685307211,-52.973676853072106,null,478630,229086676900,null,17.848715032759785,-78.001956206359026,null,23.967573270850909,-154.97172064671307,null,0,0]
[524810,524.80999999999995,233.45157084947908,1.5665127700190271,13.155431559680935,1.4947087020494669,1,0,173131.1661023552,1.570790550827331,79.501900537184255,1.5582176794402471,4.9333230248566977,1.3666787585441842,1,0,1,0,5.6928235168504546,2.6809284829622948,-18.622415409532024,-236.74525484879842,-56.745254848798425,null,524810,275425536100,null,17.08447846999594,-79.025297371900905,null,22.2639533052965,-157.71995747689752,null,0,0]
[575440,575.44000000000005,255.9729513434207,1.566889654084213,14.41756321516362,1.5013807449850989,1,0,189833.65069579415,1.5707910590249499,87.170528033163862,1.5593243080124457,5.3905280323333331,1.3842048874221176,1,0,1,0,6.9142461338163868,2.7286311405364549,-21.084918628356899,-240.05852695531175,-60.058526955311748,null,575440,331131193600,null,16.314527763302891,-79.966094559787024,null,20.571400793164671,-160.09243239552472,null,0,0]
[630960,630.96,280.66955029947997,1.5672334104946963,15.802209624538891,1.5074717240465154,1,0,208149.31225277815,1.5707915225513025,95.57991706139974,1.5603336869909454,5.8934847582255312,1.4002924933476983,1,0,1,0,8.3875878152733225,2.7703782611416781,-23.54118216759607,-242.98511449905021,-62.985114499050212,null,630960,398110521600,null,15.539614487951354,-80.830039885486073,null,18.890050529277033,-162.15507461356407,null,0,0]
[691830,691.83,307.74598651270935,1.5675468879601528,17.320843679668691,1.5130302971801042,1,0,228229.90157150998,1.5707919452480743,104.79974195639333,1.5612541737614976,6.446373123433661,1.4150413428827122,1,0,1,0,10.162571689128857,2.8071178716964851,-25.990375985291138,-245.58194832555645,-65.581948325556453,null,691830,478628748900,null,14.760669020254152,-81.622370929112009,null,17.219802179279174,-163.95957739644447,null,0,0]
[758580,758.58,337.43801669763229,1.5678328152335095,18.986688774949595,1.5181034682334766,1,0,250250.26196296266,1.5707923307950837,114.91028048026543,1.5620937753927753,7.0540170202555723,1.4285539529921789,1,0,1,0,12.299916887152039,2.839625969014671,-28.433263336297895,-247.89636823018867,-67.896368230188671,null,758580,575443616400,null,13.978181214873304,-82.348502919691924,null,15.55940263365326,-165.54786531049675,null,0,0]
[831760,831.76,369.99029428564393,1.5680935499033237,20.813471354472203,1.5227320170790377,1,0,274391.83459890087,1.5707926823715797,125.99484044019422,1.5628594105236429,7.7214307558320785,1.4409218509901263,1,0,1,0,14.871752793086738,2.8685147535482134,-30.869764517831761,-249.96609718255525,-69.966097182555245,null,831760,691824697600,null,13.192900327141853,-83.01328375938597,null,13.908182339850846,-166.95281342316926,null,0,0]
[912010,912.01,405.6875071372516,1.5683313728708195,22.817167946675941,1.526955635936825,1,0,300865.7510246514,1.5707930030533388,138.15036250836704,1.5635577737091748,8.4544569973909507,1.4522379701347516,1,0,1,0,17.966221496272404,2.8942961192748773,-33.301142809930454,-251.82326232645133,-71.823262326451328,null,912010,831762240100,null,12.405095532731005,-83.621654738148436,null,12.264608842162998,-168.20160758830298,null,0,0]
[1000000,1000,444.82768806070698,1.5685482634006005,25.01450751659457,1.5308088695756814,1,0,329893.03957672801,1.5707932955093584,151.47833205048687,1.5641946745972812,9.2592202791808358,1.462584807745984,1,0,1,0,21.688197955796181,2.9173795688101727,-35.727688603125742,-253.49385460039434,-73.493854600394343,null,1000000,1000000000000,null,11.615283315667792,-84.178009888853978,null,10.627875266030923,-169.31584471154034,null,0,0]
[]
[]
["Pole/Zero Locations for Chart"]
[{"$f":"U4*1000","v":251190},null,{"$f":"SQRT(1+(A617/pole1)^2)","v":111.74045936287914},{"$f":"ATAN(A617/pole1)","v":1.5618468974249},{"$f":"SQRT(1+(A617/Zero1)^2)","v":6.3575109548753685},{"$f":"ATAN(A617/Zero1)","v":1.4128461185617538},{"$f":"IF(VIN_nom>Vout, 1, SQRT(1+(A617/z_RHP)^2))","v":1},{"$f":"IF(VIN_nom>Vout, 0, -ATAN(A617/z_RHP))","v":0},{"$f":"SQRT(1+(A617/Pole2)^2)","v":82865.832616931453},{"$f":"ATAN(A617/Pole2)","v":1.5707842590949961},{"$f":"SQRT(1+(A617/Zero2)^2)","v":38.062151767096211},{"$f":"ATAN(A617/Zero2)","v":1.5445204849726468},{"$f":"SQRT(1+(A617/pole4)^2)","v":2.5191980335185788},{"$f":"ATAN(A617/pole4)","v":1.1626030193051105},{"$f":"IF(VOUT_setting=1,1,SQRT(1+(A617*zterm1)^2))","v":1},{"$f":"IF(VOUT_setting=1,0,ATAN(((A617*zterm1))))","v":0},{"$f":"IF(VOUT_setting=1,1,SQRT((1+Afbr-$Q$5*(A617)^2)^2+(A617*$Q$4)^2))","v":1},{"$f":"IF(VOUT_setting=1,0,ATAN(A617*$Q$4/(1+Afbr-$Q$5*(A617)^2)))","v":0},{"$f":"SQRT((1-(A617^2/(pole3^2)))^2+(A617/(Q*pole3))^2)","v":1.2747632132104956},{"$f":"ATAN((A617/(Q*pole3))/(1-A617^2/pole3^2))","v":-1.253858290183778},{"$f":"20*LOG10(((E617*K617*G617*O617)/(C617*I617*S617*M617*Q617))*Adc)","v":0.2987723936675668},{"$f":"((F617+L617+H617+P617)-(D617+J617+T617+N617+R617))*radconv","v":-4.8133773101452153},{"$f":"IF(V617>0,V617,V617+180)","v":175.18662268985477},"crossover",null,null,null,{"$f":"20*LOG10((K617/(I617*M617))*AEA)","v":22.924334992283807},{"$f":"(L617-(J617+N617))*radconv","v":-68.117049744479999},null,{"$f":"20*LOG10((E617*G617/(C617*S617))*Acs*Am)","v":35.345284586208223},{"$f":"(F617+H617-(D617+T617))*radconv","v":63.303672434334764}]
[{"$f":"A617","v":251190},null,null,null,null,null,null,null,null,null,null,null,null,null,null,null,null,null,null,null,null,-135]
[{"$f":"A618","v":251190}]
[1000000,null,null,null,null,null,null,null,null,null,null,null,null,null,null,null,null,null,null,null,null,{"$f":"V617","v":-4.8133773101452153}]
[]
[{"$f":"pole1","v":2248.0671813831877},null,1.4142135623730951,0.78539816339744828,1.0015773769154726,5.6130317492989586E-2,{"$f":"IF(VIN_nom>Vout, 1, SQRT(1+(A622/z_RHP)^2))","v":1},{"$f":"IF(VIN_nom>Vout, 0, -ATAN(A622/z_RHP))","v":0},741.62238983363898,1.5694479312815779,1.0563891273213899,0.32820996797188445,1.0002140895616876,{"$f":"ATAN(A622/pole4)","v":2.0690643942638864E-2},{"$f":"IF(VOUT_setting=1,1,SQRT(1+(A622*zterm1)^2))","v":1},{"$f":"IF(VOUT_setting=1,0,ATAN(((A622*zterm1))))","v":0},{"$f":"IF(VOUT_setting=1,1,SQRT((1+Afbr-$Q$5*(A622)^2)^2+(A622*$Q$4)^2))","v":1},{"$f":"IF(VOUT_setting=1,0,ATAN(A622*$Q$4/(1+Afbr-$Q$5*(A622)^2)))","v":0},{"$f":"SQRT((1-(A622^2/(pole3^2)))^2+(A622/(Q*pole3))^2)","v":0.9999468447397234},{"$f":"ATAN((A622/(Q*pole3))/(1-A622^2/pole3^2))","v":1.0841276247754711E-2},{"$f":"20*LOG10(((E622*K622*G622*O622)/(C622*I622*S622*M622*Q622))*Adc)","v":42.163533271753728},{"$f":"((F622+L622+H622+P622)-(D622+J622+T622+N622+R622))*radconv","v":-114.70831245190817},65.291687548091829,"p1",null,null,null,{"$f":"20*LOG10((K622/(I622*M622))*AEA)","v":40.778186838022101},{"$f":"(L622-(J622+N622))*radconv","v":-72.303183324999125},null,{"$f":"20*LOG10((E622*G622/(C622*S622))*Acs*Am)","v":59.356193618556077},{"$f":"(F622+H622-(D622+T622))*radconv","v":-42.405129126909053}]
[{"$f":"Zero1","v":40008.784131160479},null,17.825042505629089,1.5146660093019071,1.4142135623730951,0.78539816339744828,1,0,13198.619444619804,1.5707205612949402,6.1422814840712787,1.4072624394667701,1.0656606436379894,0.35286911482072136,{"$f":"IF(VOUT_setting=1,1,SQRT(1+(A623*zterm1)^2))","v":1},{"$f":"IF(VOUT_setting=1,0,ATAN(((A623*zterm1))))","v":0},{"$f":"IF(VOUT_setting=1,1,SQRT((1+Afbr-$Q$5*(A623)^2)^2+(A623*$Q$4)^2))","v":1},{"$f":"IF(VOUT_setting=1,0,ATAN(A623*$Q$4/(1+Afbr-$Q$5*(A623)^2)))","v":0},0.98365722484765628,0.19741295595778724,13.025177323380959,-82.678270504613238,97.321729495386762,"z1",null,null,null,{"$f":"20*LOG10((K623/(I623*M623))*AEA)","v":30.510870022512506},{"$f":"(L623-(J623+N623))*radconv","v":-29.583371541437884},null,40.48515448569291,-53.094898963175346]
[{"$f":"Pole2","v":3.0312855381479173},null,1.000000909085919,1.3483955133188398E-3,1.0000000028702054,7.5765499956464632E-5,1,0,1.4142135623730951,0.78539816339744828,1.0000001054158167,4.5916403923588453E-4,1.0000000003892935,2.7903170282779956E-5,1,0,1,0,0.99999999990334576,1.4617273731161308E-5,99.078412035771976,-45.049044460556011,134.95095553944398,"p2",null,null,{"$f":"Pole2","v":3.0312855381479173},{"$f":"20*LOG10((K624/(I624*M624))*AEA)","v":94.696925356239177},{"$f":"(L624-(J624+N624))*radconv","v":-44.975290623731603},null,62.352333864357263,-7.375383682440069E-2]
[{"$f":"Zero2","v":6601.7481032751111},null,3.1022270932861855,1.2425863588230122,1.0135223056095715,0.16353388732812649,1,0,2177.8709778813436,1.5703371627556608,1.4142135623730951,0.78539816339744828,1.0018447643876069,6.069485780164495E-2,1,0,1,0,0.99954191800121517,3.1854509291354416E-2,28.609541551947139,-112.10153258739564,67.898467412604361,"z2",null,null,{"$f":"Zero2","v":6601.7481032751111},{"$f":"20*LOG10((K625/(I625*M625))*AEA)","v":33.940872747530491},{"$f":"(L625-(J625+N625))*radconv","v":-48.451251083992162},null,52.639515989241104,-63.650281503403441]
[{"$f":"pole3","v":212500},null,94.530934277911044,1.5602175817573762,5.4046521401713274,1.3846982274142483,1,0,70102.270916865076,1.5707820619217769,32.203973911301141,1.53973926602085,2.1968686270019853,1.098206968123711,1,0,1,0,1.024704082928056,{"$error":"#DIV/0!"},3.4280913960866508,{"$error":"#DIV/0!"},{"$error":"#DIV/0!"},"p3",null,null,null,{"$f":"20*LOG10((K626/(I626*M626))*AEA)","v":24.11469024923332},{"$f":"(L626-(J626+N626))*radconv","v":-64.701245568687838},null,37.284248331677787,{"$error":"#DIV/0!"}]
[{"$f":"Fp2_u","v":108635.88282769165},null,{"$f":"SQRT(1+(A627/pole1)^2)","v":48.334472179507607},{"$f":"ATAN(A627/pole1)","v":1.5501056828522577},{"$f":"SQRT(1+(A627/Zero1)^2)","v":2.8935891787367125},{"$f":"ATAN(A627/Zero1)","v":1.2179272119741753},1,0,{"$f":"SQRT(1+(A627/Pole2)^2)","v":35838.221606915402},{"$f":"ATAN(A627/Pole2)","v":1.5707684236246138},{"$f":"SQRT(1+(A627/Zero2)^2)","v":16.485980490766526},{"$f":"ATAN(A627/Zero2)","v":1.5101014689932517},{"$f":"SQRT(1+(A627/pole4)^2)","v":1.4142135623730951},0.78539816339744828,1,0,1,0,0.90555206715248271,0.61688207208171797,8.7391149116053217,-102.85312418780642,{"$f":"IF(V627>0,V627,V627+180)","v":77.146875812193585},"p4",null,null,null,null,null,null,38.757671033303318,-54.377163676125875]
[{"$f":"z_RHP","v":0},null,{"$f":"SQRT(1+(A628/pole1)^2)","v":1},{"$f":"ATAN(A628/pole1)","v":0},{"$f":"SQRT(1+(A628/Zero1)^2)","v":1},{"$f":"ATAN(A628/Zero1)","v":0},1,0,{"$f":"SQRT(1+(A628/Pole2)^2)","v":1},{"$f":"ATAN(A628/Pole2)","v":0},{"$f":"SQRT(1+(A628/Zero2)^2)","v":1},{"$f":"ATAN(A628/Zero2)","v":0},{"$f":"SQRT(1+(A628/pole4)^2)","v":1},0,1,0,1,0,1,0,102.0887189506096,0,{"$f":"IF(V628>0,V628,V628+180)","v":180},"z_RHP",null,null,null,null,null,null,62.352341734803822,0]
[{"$f":"Fp2_u","v":108635.88282769165},null,null,null,null,null,null,null,null,null,null,null,null,null,null,null,null,null,null,null,-25]
[]
[null,null,null,"System","Plant"]
["p1","p-dom",{"$f":"pole1","v":2248.0671813831877},{"$f":"U622","v":42.163533271753728},{"$f":"AE622","v":59.356193618556077}]
["z1","ESR zero",{"$f":"Zero1","v":40008.784131160479},{"$f":"U623","v":13.025177323380959},{"$f":"AE623","v":40.48515448569291}]
["p2","EA pole",{"$f":"Pole2","v":3.0312855381479173},{"$f":"U624","v":99.078412035771976},{"$f":"AE624","v":62.352333864357263}]
["z2","EA zero",{"$f":"Zero2","v":6601.7481032751111},{"$f":"U625","v":28.609541551947139},{"$f":"AE625","v":52.639515989241104}]
["p3","p_sampling",{"$f":"pole3","v":212500},{"$f":"U626","v":3.4280913960866508},{"$f":"AE626","v":37.284248331677787}]
[]
[]
[{"$f":"U4*1000","v":251190}]
[{"$f":"U4*1000","v":251190}]
[]
[]
[]
[]
[]
[]
[]
[]
[]
[]
[]
[]
[]
[]
[]
[]
[]
[]
[]
[]
[]
[]
[]
[]
[]
[]
[]
[]
[]
[]
[]
[]
[]
[]
[]
[]
[]
[]
[]
[]
[]
[]
[]
[]
[]
[]
[null,null,null,null,null,null,null,null,null,null,null,null,null,null,null,null,null,null,null,null,null,null,null,null,null,null,null,null,null,null,null,null,null,"phase margin",{"$f":"SUM(AI689:AI1306)","v":0}]

{"sheet":"Bode Plot Management","index":8,"n_rows":6,"n_cols":14,"rows_kept":6,"cut":false,"hidden":true,"merged":[]}
[null,null,null,null,null,null,null,null,null,"Single or dual output (MODE)",null,null,null,"3.3V or 5V fixed (FB1/2)"]
[{"$f":"CHOOSE(BODE_PLOT_TYPE, \"BODE_PLOT_Ch1\", \"BODE_PLOT_Ch2\")","v":"BODE_PLOT_Ch1"},null,null,null,null,null,null,null,null,"With/without dither (DITH)",null,null,null,"With/without VOUT connected to VCCX"]
[null,null,null,null,null,null,null,null,null,"FPWM or DEM (DEMB)"]
[null,null,null,null,null,null,null,null,null,"Shunt or inductor DCR current sensing"]
[]
[null,null,null,null,null,{"$f":"INDIRECT(A2)","v":0}]

{"sheet":"Efficiency Calculations","index":9,"n_rows":109,"n_cols":57,"rows_kept":109,"cut":false,"hidden":true,"merged":[[6,51,6,56],[6,27,6,32],[6,33,6,36],[6,40,6,44],[6,45,6,49],[6,24,6,26],[0,0,3,3],[5,0,6,3],[6,6,6,13],[6,17,6,20],[6,21,6,23]]}
["BUCK CONTROLLER POWER DESIGN TOOL"]
[null,null,null,null,null,null,null,{"$f":"AV19","v":0.96914376112068379},"10% load"]
[null,null,null,null,null,null,null,{"$f":"AV59","v":0.97591234831049412},"50% load",null,null,null,null,null,null,null,null,null,null,null,null,null,null,null,null,null,null,null,null,null,null,null,null,null,null,null,null,null,null,null,null,{"$f":"IF(MODE=1, (Qg_Q1+Qg_Q2)*Fsw*Vin, (Qg_Q1+Qg_Q2+Qg_Q3+Qg_Q4)*Fsw*Vin)","v":0.33660000000000001}]
[null,null,null,null,null,null,null,{"$f":"AV109","v":0.96203822992075427},"100% load",null,null,null,null,null,null,null,null,null,null,null,null,null,null,null,null,null,null,null,null,null,null,null,null,null,null,null,null,null,null,null,"I_VCC",{"$f":"(Qg_Q1+Qg_Q2)*Fsw*1000","v":14.024999999999999},"mA",{"$f":"AP4*5/1000","v":7.0125000000000007E-2}]
[]
["Enter the values of your design and MOSFET datasheet specifications below. Note that thermal resistance (θJA) will change when components are placed on the PCB"]
[null,null,null,null,null,null,"Operating Point Condtions",null,null,null,null,null,null,null,null,null,null,"Filter Inductor",null,null,null,"Cout",null,null,"Cin",null,null,"High-side BUCK \"Control\" MOSFET Losses ",null,null,null,null,null,"Low-side BUCK \"Sync\" MOSFET Losses ",null,null,null,"External Diode","Diode/FET","Sense Rs","Controller IC Losses",null,null,null,null,"RESULTS",null,null,null,null,null,"Consolidated Buck/Boost Efficiency & Losses"]
["Input Parameters",null,null,null,null,null,"Step","Vin","Mode","Iout","Iout/ phase","Iin","Duty Cycle BUCK Leg","Ripple Current pk-pk","Peak Inductor Current","Valley Inductor Current","SW node voltage at Q1 turn-on","Irms Lf","DCR    Loss","Core Loss","Total Inductor Loss","Irms Cout","Cout ESR Loss","Total Cout Loss","Irms Cin","Cin ESR Loss","Total Cin Loss","Irms","RDS(on) Loss","Transition Loss (not including capacitive loss)","MOSFET Output Capacitance Loss","Dead Time Loss ","Total Control MOSFET Loss","Irms","RDS(on) Loss","Deadtime Loss","Total Sync MOSFET Loss","Deadtime Loss","Reverse Recovery Loss","Isense Shunt Loss","IQ Loss","Switching Current Loss","Switching Current Diss","LDO Loss Saved from Gate Drive Current (ext VCC)","Total IC Loss","Total Loss","Pout","EFF, h",{"$f":"IF(Vin>Vout, \"Buck ''CONTROL'' MOSFET Temp Rise\", \"Boost ''CONTROL'' MOSFET Temp Rise\")","v":"Buck ''CONTROL'' MOSFET Temp Rise"},{"$f":"IF(Vin>Vout, \"Buck ''SYNC'' MOSFET Temp Rise\", \"Boost ''SYNC'' MOSFET Temp Rise\")","v":"Buck ''SYNC'' MOSFET Temp Rise"},null,"h","Inductor Cu & Core Loss","Total MOSFET Loss","Control MOSFET Loss","SYNC MOSFET Loss","Shunt Loss"]
["Design","Input Value","Units","Description",null,null,0,{"$f":"Vin","v":24},{"$f":"MODE","v":1},0,{"$f":"Iout*G9/100/Number_of_Phases","v":0},{"$f":"Vout*K9/(Vin*Efficiency)","v":0},{"$f":"(Vout+(Rdson2+Rs+Rdcr)*K9)/(Vin+(Rs+Rdson2-Rdson1)*K9)","v":0.79166666666666663},{"$f":"(Vin-(Rdson1+Rdcr)*K9-Vout)*M9/(Fsw*Lf)","v":1.9816437213183145},{"$f":"K9+N9/2","v":0.99082186065915723},{"$f":"K9-N9/2","v":-0.99082186065915723},{"$f":"IF(MIN(Vin, -P9/(Coss_Q1+Coss_Q2)*0.00000002)<0, 0, MIN(Vin, -P9/(Coss_Q1+Coss_Q2)*0.00000002))","v":24},{"$f":"SQRT(K9^2+(N9^2)/12)","v":0.5720512679705303},{"$f":"R9^2*Rdcr","v":1.7016617965707954E-3},{"$f":"Core_Loss_Ch1","v":0.2},{"$f":"(T9+S9*(1+Ltc*(Ta-25)))/(1-S9*Ltc*ThetaCa)","v":0.20176316164563243},{"$f":"N9/SQRT(12)","v":0.5720512679705303},{"$f":"RCoutEsr*V9^2","v":2.1696187906277642E-2},{"$f":"W9","v":2.1696187906277642E-2},{"$f":"SQRT(M9*(1-M9))*SQRT(K9^2+(N9^2)/12)","v":0.23231941931649844},{"$f":"RCinEsr*Y9^2","v":7.1783175746768192E-3},{"$f":"Z9","v":7.1783175746768192E-3},{"$f":"SQRT(M9)*SQRT(K9^2+(N9^2)/12)","v":0.50898634602459036},{"$f":"Rdson1*AB9^2","v":3.1088052052735682E-3},{"$f":"(Vin*K9/2)*Fsw*(Tr_buck+Tf_buck)","v":0},{"$f":"(0.5*Coss_Q1*(Vin-Q9)^2-0.5*Coss_Q2*(Vin-Q9)^2+(Qoss_Q2*(Vin-Q9)/Vin)*Vin)*Fsw","v":0},{"$f":"IF(K9>N9/2,0,ABS(K9-N9/2)*Vsd_Q1*Deadtime*Fsw)","v":4.1267730496453896E-3},{"$f":"(AF9+AE9+AD9+AC9*(1+RdsonTopTc*Ta-RdsonTopTc*25))/(1-AC9*RdsonTopTc*ThetaJA_Q1)","v":7.3015678165662757E-3},{"$f":"SQRT((1-M9))*SQRT(K9^2+(N9^2)/12)","v":0.26110448626407667},{"$f":"Rdson2*AH9^2","v":2.7951976626363234E-4},{"$f":"IF(K9<N9/2,Deadtime*Fsw*IF(VfdSky_Q2>0,0,Vsd_Q2)*(K9+N9/2),2*Deadtime*Fsw*IF(VfdSky_Q2>0,0,Vsd_Q2)*K9)","v":4.1267730496453896E-3},{"$f":"(AJ9+AI9*(1+RdsonBotTc*Ta-RdsonBotTc*25))/(1-AI9*RdsonBotTc*ThetaJA_Q2)","v":4.4120839867249646E-3},{"$f":"2*Deadtime*Fsw*IF(VfdSky_Q2>0,VfdSky_Q2,Vsd_Q2)*K9","v":0},{"$f":"IF(QrrSky_Q2>0,QrrSky_Q2,Qrr_Q2*K9/(Iout/Number_of_Phases))*Fsw*Vin","v":0},{"$f":"Rs*R9^2","v":9.8172795956007436E-4},{"$f":"Iq*Vin","v":5.2800000000000003E-5},{"$f":"IF(Ext_VCC=1,  (Qg_Q1+Qg_Q2)*Fsw*VCC, (Qg_Q1+Qg_Q2)*Fsw*Vin)","v":7.0124999999999993E-2},{"$f":"(Vin-VCC)*Fsw*(Qg_Q1+Qg_Q2)+(RdsonDRT+RdsonDRT2)*Fsw*Qg_Q1*VCC/(RdsonDRT+2*Rgate1+RdsonDRT2)+(RdsonDRB+RdsonDRB2)*Fsw*Qg_Q2*VCC/(RdsonDRB+2*Rgate2+RdsonDRB2)","v":0.2934461538461538},{"$f":"(Qg_Q1+Qg_Q2)*Fsw*(Vin-VCC)","v":0.26647499999999996},{"$f":"SUM(AO9:AP9)","v":7.0177799999999999E-2},{"$f":" SUM(U9,X9,AA9,AG9,AK9,AL9,AM9,AS9,AN9)","v":0.3135108468894382},{"$f":"Vout*K9","v":0},{"$f":"AU9/(AU9+AT9)","v":0},{"$f":"ThetaJA_Q1*BC9","v":0.30666584829578358},{"$f":"ThetaJA_Q2*BD9","v":0.17957181825970606},null,{"$f":"AV9*100","v":0},{"$f":"U9","v":0.20176316164563243},{"$f":"AG9+AK9+AM9","v":1.1713651803291241E-2},{"$f":"AG9+AM9*0.66","v":7.3015678165662757E-3},{"$f":"AK9+AM9*0.33","v":4.4120839867249646E-3},{"$f":"AN9","v":9.8172795956007436E-4}]
[null,null,null,null,null,null,1,24,1,{"$f":"Iout*G10/100","v":0.13},0.13,0.11435185185185186,0.79175430614554232,1.9809768050559049,{"$f":"K10+N10/2","v":1.1204884025279525},{"$f":"K10-N10/2","v":-0.86048840252795245},24,{"$f":"SQRT(K10^2+(N10^2)/12)","v":0.58644899623137881},1.7883966109401169E-3,0.2,0.20185304400714377,{"$f":"N10/SQRT(12)","v":0.57185874582871576},2.1681586789486489E-2,{"$f":"W10","v":2.1681586789486489E-2},{"$f":"SQRT(M10*(1-M10))*SQRT(K10^2+(N10^2)/12)","v":0.23812965303651257},7.541862310153552E-3,{"$f":"Z10","v":7.541862310153552E-3},{"$f":"SQRT(M10)*SQRT(K10^2+(N10^2)/12)","v":0.52182569993907924},3.2676247334029198E-3,5.4048675905659536E-3,0,3.5839341965289216E-3,1.2328546906051771E-2,0.26761981253988237,2.9364349266191529E-4,4.6668341965289215E-3,4.9665879875804824E-3,1.0828999999999999E-3,6.0179999999999999E-3,1.0317672755423752E-3,5.2800000000000003E-5,7.0124999999999993E-2,0.2934461538461538,0.26647499999999996,7.0177799999999999E-2,0.32668209527595848,2.4700000000000002,{"$f":"AU10/(AU10+AT10)","v":0.88318940653720468},0.68461793005417437,0.28296788909452564,null,{"$f":"AV10*100","v":88.318940653720475},0.20185304400714377,2.3313134893632254E-2,1.6300426906051772E-2,6.9525279875804827E-3,1.0317672755423752E-3]
["Vin",{"$f":"Vin","v":24},"V","Vin",null,null,2,24,1,0.26,0.26,0.22870370370370371,0.79184195027686055,1.9803097042216093,1.2501548521108048,-0.73015485211080466,24,0.62801449854775637,2.0508914940081872E-3,0.2,0.20212507225120085,0.5716661704055872,2.1666986548604387E-2,2.1666986548604387E-2,0.25496791251382267,8.6461486427502916E-3,8.6461486427502916E-3,0.55884185192745295,3.7476505855884631E-3,1.0809735181131907E-2,0,3.041094959041501E-3,1.768456803520815E-2,0.2865274767286457,3.3660177917398679E-4,5.2068949590415008E-3,5.5505329361747692E-3,2.1657999999999998E-3,1.2036E-2,1.1832066311585697E-3,5.2800000000000003E-5,7.0124999999999993E-2,0.2934461538461538,0.26647499999999996,7.0177799999999999E-2,0.34123611504509699,4.9400000000000004,0.93538707461440906,1.0763897774787423,0.38756220650231321,null,93.538707461440907,0.20212507225120085,3.5271100971382918E-2,2.5628328035208151E-2,9.5224129361747706E-3,1.1832066311585697E-3]
["Vout",{"$f":"Vout","v":19},"V","Vout",null,null,3,24,1,0.39,0.39,0.34305555555555556,0.79192959906099192,1.9796424188007302,1.3798212094003652,-0.5998212094003651,24,0.69186849101516434,2.4891464460699226E-3,0.2,0.20257926933245585,0.57147354169690179,2.1652387187391514E-2,2.1652387187391514E-2,0.28084842467449711,1.0490486406405508E-2,1.0490486406405508E-2,0.61569672027215938,4.5489894162467244E-3,1.621460277169786E-2,0,2.4982553371525203E-3,2.3370687899422055E-2,0.31559397571200076,4.0835818577339834E-4,5.7469553371525201E-3,6.1638904664722566E-3,3.2486999999999998E-3,1.8054000000000001E-2,1.4360460265788017E-3,5.2800000000000003E-5,7.0124999999999993E-2,0.2934461538461538,0.26647499999999996,7.0177799999999999E-2,0.35717326731872601,7.41,0.95401502515444414,1.4820257717757264,0.49335361598542093,null,95.40150251544442,0.20257926933245585,4.7588578365894314E-2,3.5286327899422057E-2,1.2121710466472257E-2,1.4360460265788017E-3]
["Fsw",{"$f":"Fsw/1000","v":425},"kHz","Switching Frequency",null,null,4,24,1,0.52,0.52,0.45740740740740743,0.7920172524983069,1.9789749487785682,1.5094874743892841,-0.46948747438928407,19.480808065945396,0.77250360559531461,3.103161467420359E-3,0.2,0.20321567358059528,0.57128085969841613,2.1637788709609581E-2,2.1637788709609581E-2,0.3135317248078543,1.3074184947311414E-2,1.3074184947311414E-2,0.68749229638829235,5.6717478911189716E-3,2.1619470362263814E-2,5.6534720198177409E-2,1.9554153308313682E-3,8.5976711963654501E-2,0.35230123909023348,5.0887626856450669E-4,6.2870153308313675E-3,6.8066330206644878E-3,4.3315999999999997E-3,2.4072E-2,1.7902854619732842E-3,5.2800000000000003E-5,7.0124999999999993E-2,0.2934461538461538,0.26647499999999996,7.0177799999999999E-2,0.43108267768380854,9.8800000000000008,0.95819229743770784,4.2782977424734892,0.60034099594104473,null,95.819229743770791,0.20321567358059528,0.11685534498431899,0.1018642319636545,1.4750393020664488E-2,1.7902854619732842E-3]
["Iout",{"$f":"Iout","v":13},"A","Max Output Current",null,null,5,24,1,0.65,0.65,0.57175925925925919,0.79210491058917609,1.9783072941404225,1.6391536470702113,-0.33915364707021123,14.072765438597978,0.86524080222642841,3.8929365583546538E-3,0.2,0.20403433870842716,0.57108812440588663,2.1623191119021837E-2,2.1623191119021837E-2,0.35111587021130558,1.6396553123794236E-2,1.6396553123794236E-2,0.77006670096777574,7.1160326872727253E-3,2.7024337952829772E-2,0.12133677264965512,1.4125749400474294E-3,0.15721999436353978,0.3945109908456792,6.3811957978196217E-4,6.8270749400474286E-3,7.4787338461791038E-3,5.4144999999999992E-3,3.0090000000000002E-2,2.2459249375123003E-3,5.2800000000000003E-5,7.0124999999999993E-2,0.2934461538461538,0.26647499999999996,7.0177799999999999E-2,0.51468103609847438,12.35,0.95999270913485746,7.4373345632686707,0.70852325753948975,null,95.999270913485745,0.20403433870842716,0.1947887282097189,0.17707939436353978,1.7408433846179107E-2,2.2459249375123003E-3]
["Ta",{"$f":"Ta","v":30},"°C","Ambient Temperature",null,null,6,24,1,0.78,0.78,0.68611111111111112,0.79219257333397008,1.9776394548715905,1.7688197274357953,-0.20881972743579524,8.6647189807383924,0.96660306457997547,4.8584717191680806E-3,0.2,0.20503533382321629,0.57089533581506879,2.1608594419393029E-2,2.1608594419393029E-2,0.39218780320008084,2.0456899306194411E-2,2.0456899306194411E-2,0.86032699660764944,8.8819504931032609E-3,3.242920554339572E-2,0.18303138191128759,8.6973416477008705E-4,0.22572673325894108,0.4406347051282522,7.9605166779019314E-4,7.3671341647700865E-3,8.1801669927480808E-3,6.4973999999999995E-3,3.6108000000000001E-2,2.8029644533662007E-3,5.2800000000000003E-5,7.0124999999999993E-2,0.2934461538461538,0.26647499999999996,7.0177799999999999E-2,0.59659389225385906,14.82,0.96130183512496747,10.481436556875526,0.81789934460484703,null,96.130183512496743,0.20503533382321629,0.27001490025168917,0.24955801325894109,2.0095806992748082E-2,2.8029644533662007E-3]
["Vcc",{"$f":"VCC","v":5},"V","Subregulated VCC Voltage",null,null,7,24,1,0.91,0.91,0.80046296296296282,0.79228024073305947,1.9769714309573687,1.8984857154786843,-7.8485715478684326E-2,3.2566686920615906,1.0741514495491169,5.9997669501560382E-3,0.2,0.20621874344127131,0.57070249392171823,2.1593998614489483E-2,2.1593998614489483E-2,0.43575646244434052,2.5254531376746794E-2,2.5254531376746794E-2,0.9561035512404461,1.0969608008335109E-2,3.7834073133961678E-2,0.24161854138319822,3.2689300496872018E-4,0.29150572187883161,0.48955830691948904,9.8263607708289394E-4,7.9071930049687197E-3,8.9109073095347806E-3,7.580299999999999E-3,4.2125999999999997E-2,3.461404009705407E-3,5.2800000000000003E-5,7.0124999999999993E-2,0.2934461538461538,0.26647499999999996,7.0177799999999999E-2,0.67682940663057933,17.29,0.96232894567470006,13.410973038910928,0.92846823349806562,null,96.232894567470012,0.20621874344127131,0.34254262918836637,0.31930888187883161,2.2812487309534779E-2,3.461404009705407E-3]
["Components","Input Value","Units","Description",null,null,8,24,1,1.04,1.04,0.91481481481481486,0.79236791278681518,1.9763032223830517,2.0281516111915261,5.18483888084742E-2,0,1.1862045364242499,7.3168222516140427E-3,0.2,0.20758466750579035,0.57050959872158991,2.157940370807903E-2,2.157940370807903E-2,0.48113866140615352,3.0788756729460798E-2,3.0788756729460798E-2,1.0559005612913068,1.3379111944023562E-2,4.3238940724527629E-2,0.27539999999999992,0,0.33303419280087221,0.5405138359914321,1.1978363482825082E-3,8.6631999999999994E-3,9.8869211015607562E-3,8.6631999999999994E-3,4.8143999999999999E-2,4.2212436067004091E-3,5.2800000000000003E-5,7.0124999999999993E-2,0.2934461538461538,0.26647499999999996,7.0177799999999999E-2,0.73408018545246345,19.760000000000002,0.96418086692304728,15.321987777636632,1.049019752833523,null,96.418086692304726,0.20758466750579035,0.39106511390243298,0.36480923280087219,2.5774441101560758E-2,4.2212436067004091E-3]
["L",{"$f":"Lf*1000000","v":4.7},"uH","Filter Inductance",null,null,9,24,1,1.17,1.17,1.0291666666666666,0.79245558949560735,1.9756348291339312,2.1578174145669653,0.18218258543303434,0,1.3015994320478381,8.8096376238377249E-3,0.2,0.2091332214079713,0.57031665021043776,2.1564809703930994E-2,2.1564809703930994E-2,0.52786192565518097,3.7058882270000648E-2,3.7058882270000648E-2,1.1586834850580841,1.6110569022556167E-2,4.864380831509358E-2,0.27539999999999992,0,0.34140061529183718,0.5929702041088637,1.4416160181397204E-3,9.7460999999999989E-3,1.1219181425271637E-2,9.7460999999999989E-3,5.4161999999999988E-2,5.0824832445217644E-3,5.2800000000000003E-5,7.0124999999999993E-2,0.2934461538461538,0.26647499999999996,7.0177799999999999E-2,0.75954509334353348,22.229999999999997,0.96696128217154442,15.840196482257163,1.1840705060085555,null,96.696128217154438,0.2091332214079713,0.40678179671710879,0.3771475352918372,2.9092641425271633E-2,5.0824832445217644E-3]
["Rdcr",{"$f":"Rdcr*1000","v":5.2},"mW","Inductor DCR at 25°C",null,null,10,24,1,1.3,1.3,1.1435185185185184,0.79254327085980736,1.9749662511953001,2.28748312559765,0.31251687440234999,0,1.4195213892177538,1.0478213067122849E-2,0.2,0.21086453601139551,0.5701236483840163,2.1550216605816304E-2,2.1550216605816304E-2,0.57559524218308034,4.406421441556526E-2,4.406421441556526E-2,1.2637274883472791,1.9164085977654271E-2,5.4048675905659545E-2,0.27539999999999992,0,0.35012328879481969,0.64655534151546468,1.7139386195329344E-3,1.0828999999999998E-2,1.2580727782423475E-2,1.0828999999999998E-2,6.0180000000000004E-2,6.0451229233401058E-3,5.2800000000000003E-5,7.0124999999999993E-2,0.2934461538461538,0.26647499999999996,7.0177799999999999E-2,0.78641490653336033,24.7,0.96914376112068379,16.373367729382426,1.3203132007446357,null,96.914376112068382,0.21086453601139551,0.42288401657724317,0.38984208879481969,3.2440127782423479E-2,6.0451229233401058E-3]
["LTc",{"$f":"Ltc*1000000","v":4000},"ppm","Inductor Series Resistance Temp Co",null,null,11,24,1,1.43,1.43,1.2578703703703702,0.7926309568797858,1.9742974885524478,2.4171487442762238,0.44285125572377604,0,1.5393897755632613,1.2322548581765281E-2,0.2,0.21277875767969465,0.56993059323807893,2.1535624417507379E-2,2.1535624417507379E-2,0.6241027188853322,5.1804059094768512E-2,5.1804059094768512E-2,1.3705160084914019,2.253976955437445E-2,5.9453543496225489E-2,0.27539999999999992,0,0.35920430064447778,0.70100410239705702,2.0147676814677644E-3,1.1911899999999998E-2,1.3971545760487262E-2,1.1911899999999998E-2,6.6197999999999993E-2,7.1091626433261237E-3,5.2800000000000003E-5,7.0124999999999993E-2,0.2934461538461538,0.26647499999999996,7.0177799999999999E-2,0.81469115024026162,27.169999999999998,0.97088797064557686,16.921589187068065,1.4577472504518316,null,97.088797064557681,0.21277875767969465,0.43937384640496502,0.40289498064447776,3.5816885760487263E-2,7.1091626433261237E-3]
["ThetaCa",{"$f":"ThetaCa","v":20},"°C/W","Core to Ambient Thermal Resistance",null,null,12,24,1,1.56,1.56,1.3722222222222222,0.79271864755591315,1.9736285411906613,2.5468142705953305,0.57318572940466939,0,1.6607831892062848,1.434264416806103E-2,0.2,0.21487604830751136,0.56973748476837838,2.1521033142778138E-2,2.1521033142778138E-2,0.67321315568612261,6.0277721747519393E-2,6.0277721747519393E-2,1.4786741389138138,2.6237726509110104E-2,6.485841108679144E-2,0.27539999999999992,0,0.36864586024171958,0.75612405890679701,2.3440667290765263E-3,1.2994799999999999E-2,1.5391621722967515E-2,1.2994799999999999E-2,7.2216000000000002E-2,8.274602404650595E-3,5.2800000000000003E-5,7.0124999999999993E-2,0.2934461538461538,0.26647499999999996,7.0177799999999999E-2,0.84437548756714664,29.64,0.97230136835469971,17.484953650152224,1.5963721001247781,null,97.230136835469978,0.21487604830751136,0.45625348196468712,0.4163084202417196,3.9222901722967517E-2,8.274602404650595E-3]
["Cin",{"$f":"Cin*1000000","v":120},"μF","Input Capacitance",null,null,13,24,1,1.69,1.69,1.486574074074074,0.79280634288856078,1.9729594090952292,2.6764797045476145,0.70352029545238537,0,1.7833902365517527,1.6538499826306206E-2,0.2,0.21715658535476601,0.56954432297066782,2.1506442785404114E-2,2.1506442785404114E-2,0.72280004475546955,6.9484507324901662E-2,6.9484507324901662E-2,1.587924841042361,3.0258063609592892E-2,7.0263278677357391E-2,0.27539999999999992,0,0.37845030066861979,0.81177301940179603,2.7017992836177052E-3,1.4077699999999997E-2,1.6840942807216167E-2,1.4077699999999997E-2,7.8233999999999998E-2,9.5414422074843498E-3,5.2800000000000003E-5,7.0124999999999993E-2,0.2934461538461538,0.26647499999999996,7.0177799999999999E-2,0.87546972114839194,32.11,0.97345892817202806,18.063559108082032,1.7361872262536981,null,97.34589281720281,0.21715658535476601,0.47352524347583591,0.43008474066861979,4.2658162807216168E-2,9.5414422074843498E-3]
["RCinEsr",{"$f":"RCinEsr*1000","v":133},"mW","Input Capacitor ESR",null,null,14,24,1,1.82,1.82,1.6009259259259256,0.7928940428780995,1.9722900922514355,2.8061450461257178,0.83385495387428232,0,1.9069768441172619,1.8910115556797044E-2,0.2,0.21962056188424336,0.56935110784069909,2.1491853349162298E-2,2.1491853349162298E-2,0.77276828948981169,7.9423720289054256E-2,7.9423720289054256E-2,1.698059864347502,3.4600887634894287E-2,7.5668146267923356E-2,0.27539999999999992,0,0.38862008041098944,0.8678440995314628,3.0879288624754589E-3,1.5160599999999998E-2,1.8319496922300969E-2,1.5160599999999998E-2,8.4251999999999994E-2,1.0909682051998295E-2,5.2800000000000003E-5,7.0124999999999993E-2,0.2934461538461538,0.26647499999999996,7.0177799999999999E-2,0.90797579490774849,34.58,0.97441455099735397,18.657508817261554,1.8771921367376496,null,97.441455099735393,0.21962056188424336,0.49119157733329039,0.44422640041098943,4.612265692230097E-2,1.0909682051998295E-2]
["Cout",{"$f":"Cout*1000000","v":60},"μF","Output Capcitance",null,null,15,24,1,1.95,1.95,1.7152777777777775,0.79298174752489992,1.9716205906445634,2.9358102953222818,0.96418970467771825,0,2.0313642327561876,2.1457491359829901E-2,0.2,0.2222681866025136,0.56915783937422382,2.1477264837831234E-2,2.1477264837831234E-2,0.82304525594356592,9.0094664613050934E-2,9.0094664613050934E-2,1.8089201515320996,3.9266305375426976E-2,8.1073013858489307E-2,0.27539999999999992,0,0.39915778519112205,0.92425566349480393,3.5024189791591025E-3,1.6243499999999998E-2,1.9827272746927936E-2,1.6243499999999998E-2,9.0269999999999989E-2,1.2379321938363405E-2,5.2800000000000003E-5,7.0124999999999993E-2,0.2934461538461538,0.26647499999999996,7.0177799999999999E-2,0.9418957959298091,37.049999999999997,0.97520798117079699,19.266911378027125,2.0193863707999671,null,97.520798117079693,0.2222681866025136,0.50925505793804993,0.45873598519112202,4.9616372746927935E-2,1.2379321938363405E-2]
["RCoutEsr",{"$f":"Cout_ESR*1000","v":66.3},"mW","Output Capacitor ESR",null,null,16,24,1,2.08,2.08,1.8296296296296297,0.7930694568293335,1.9709509042598961,3.0654754521299479,1.094524547870052,0,2.1564138337179721,2.4180627235701257E-2,0.2,0.22509968390420423,0.56896451756699373,2.1462677255191038E-2,2.1462677255191038E-2,0.87357464478192592,0.10149664378078047,0.10149664378078047,1.9203824192277124,4.4254423632946571E-2,8.6477881449055258E-2,0.27539999999999992,0,0.41006612991342023,0.98094443582262103,3.9452331433025766E-3,1.7326399999999999E-2,2.1364259727417588E-2,1.7326399999999999E-2,9.6287999999999999E-2,1.3950361866750726E-2,5.2800000000000003E-5,7.0124999999999993E-2,0.2934461538461538,0.26647499999999996,7.0177799999999999E-2,0.97723195644776428,39.520000000000003,0.97586916662603707,19.891880816363649,2.1627694989058961,null,97.586916662603713,0.22509968390420423,0.52771838964083784,0.47361620991342024,5.3139299727417592E-2,1.3950361866750726E-2]
["Top Driver","Input Value","Units","Description",null,null,17,24,1,2.21,2.21,1.9439814814814815,0.79315717079177106,1.9702810330827132,3.1951405165413567,1.2248594834586433,0,2.2820167861879961,2.7079523184707709E-2,0.2,0.22811529391964053,0.56877114241475923,2.1448090605023298E-2,2.1448090605023298E-2,0.9243122246420602,0.11362896078682634,0.11362896078682634,2.0323498144707792,4.9565349220552932E-2,9.1882749039621209E-2,0.27539999999999992,0,0.42134796072579772,1.0378607055209188,4.4163348606639551E-3,1.8409299999999996E-2,2.2930448075734612E-2,1.8409299999999996E-2,0.10230600000000001,1.5622801837331371E-2,5.2800000000000003E-5,7.0124999999999993E-2,0.2934461538461538,0.26647499999999996,7.0177799999999999E-2,1.0139866559503539,41.99,0.97642110104668511,20.532536670483506,2.307341122682399,null,97.642110104668518,0.22811529391964053,0.54658440880153236,0.48886992072579771,5.6691428075734615E-2,1.5622801837331371E-2]
["RdsonDRT",0.7,"W","Drain to Source Resistance of pullup Top FET Driver",null,null,18,24,1,2.34,2.34,2.0583333333333331,0.79324488941258342,1.9696109770982932,3.3248054885491465,1.3551945114508532,0,2.4080865052482729,3.015417920714597E-2,0.2,0.231315272565873,0.56857771391327072,2.1433504891111167E-2,2.1433504891111167E-2,0.97522281293033342,0.12649091813634702,0.12649091813634702,2.1447453027242278,5.519918896269168E-2,9.728761663018716E-2,0.27539999999999992,0,0.43300625719995156,1.0949649324070614,4.9156876331249207E-3,1.9492199999999998E-2,2.4525828767570659E-2,1.9492199999999998E-2,0.10832399999999998,1.7396641850276524E-2,5.2800000000000003E-5,7.0124999999999993E-2,0.2934461538461538,0.26647499999999996,7.0177799999999999E-2,1.0521624234111298,44.459999999999994,0.97688173078610063,21.189004082397968,2.4531008748401257,null,97.688173078610063,0.231315272565873,0.56585608596752213,0.50450009719995159,6.0272748767570654E-2,1.7396641850276524E-2]
["RdsonDRT2",{"$f":"RdsonDRT2","v":0.5},"W","Drain to Source Resistance of pulldown Top FET Driver",null,null,19,24,1,2.4700000000000002,2.4700000000000002,2.1726851851851854,0.79333261269214217,1.9689407362919129,3.4544703681459565,1.4855296318540439,0,2.5345533403841554,3.3404595303312898E-2,0.2,0.23469989160111251,0.56838423205827793,2.1418920117239313E-2,2.1418920117239313E-2,1.0262781059313058,0.14008181784495516,0.14008181784495516,2.257506915736101,6.1156049695155881E-2,0.10269248422075312,0.27539999999999992,0,0.44504413463379805,1.1522253081130256,5.4432549586902424E-3,2.0575099999999999E-2,2.6150393540479863E-2,2.0575099999999999E-2,0.11434200000000003,1.9271881905757439E-2,5.2800000000000003E-5,7.0124999999999993E-2,0.2934461538461538,0.26647499999999996,7.0177799999999999E-2,1.0917619396433422,46.930000000000007,0.97726526692178572,21.861413894619517,2.6000484190975315,null,97.726526692178567,0.23469989160111251,0.58553652817427793,0.52050985463379806,6.3883253540479884E-2,1.9271881905757439E-2]
["Bottom Driver","Input Value","Units","Description",null,null,20,24,1,2.6,2.6,2.2870370370370368,0.79342034063081823,1.9682703106488508,3.5841351553244256,1.6158648446755746,0,2.6613606797993037,3.6830771473505421E-2,0.2,0.23826943868259468,0.56819069684553125,2.1404336287194028E-2,2.1404336287194028E-2,1.0774550962804608,0.15440096143859805,0.15440096143859805,2.3705842856612254,6.7436038265087303E-2,0.10809735181131909,0.27539999999999992,0,0.45746484647958585,1.2096159773076209,5.9990003314872699E-3,2.1657999999999997E-2,2.7804134892066904E-2,2.1657999999999997E-2,0.12036000000000001,2.1248522003945437E-2,5.2800000000000003E-5,7.0124999999999993E-2,0.2934461538461538,0.26647499999999996,7.0177799999999999E-2,1.1327880397839847,49.4,0.97758310824069017,22.549902752142607,2.7481834501071236,null,97.758310824069014,0.23826943868259468,0.60562898137165277,0.53690244647958585,6.7522934892066913E-2,2.1248522003945437E-2]
["RdsonDRB",0.7,"W","Drain to Source Resistance of pullup Bottom FET Driver",null,null,21,24,1,2.73,2.73,2.4013888888888886,0.79350807322898265,1.967599700154379,3.7137998500771894,1.7462001499228106,0,2.7884620698521196,4.0432707718020627E-2,0.2,0.24202421742789662,0.56799710827077887,2.1389753404763005E-2,2.1389753404763005E-2,1.128734902823914,0.16944764995343711,0.16944764995343711,2.4839360822925456,7.4039261530978076E-2,0.11350221940188503,0.27539999999999992,0,0.47027178690141636,1.2671157224536074,6.582887241765421E-3,2.2740899999999998E-2,2.9487046078227233E-2,2.2740899999999998E-2,0.12637800000000002,2.3326562145011904E-2,5.2800000000000003E-5,7.0124999999999993E-2,0.2934461538461538,0.26647499999999996,7.0177799999999999E-2,1.1752437159107521,51.87,0.97784450341665141,23.254613209859489,2.8975056933838488,null,97.784450341665135,0.24202421742789662,0.62613683297964362,0.55368126690141639,7.1191786078227237E-2,2.3326562145011904E-2]
["RdsonDRB2",0.5,"W","Drain to Source Resistance of pulldown Bottom FET Driver",null,null,22,24,1,2.86,2.86,2.5157407407407404,0.79359581048700678,1.9669289047937701,3.8434644523968848,1.8765355476031149,0,2.9158190575507423,4.4210404037155718E-2,0.2,0.24596454747973043,0.56780346632976952,2.1375171473735542E-2,2.1375171473735542E-2,1.1801018942107322,0.18522118393572784,0.18522118393572784,2.597528093570761,8.0965826362672216E-2,0.11890708699245098,0.27539999999999992,0,0.4834684934661353,1.3247069787265213,7.1948791758956665E-3,2.3823799999999996E-2,3.1199121111439142E-2,2.3823799999999996E-2,0.13239599999999999,2.5506002329128301E-2,5.2800000000000003E-5,7.0124999999999993E-2,0.2934461538461538,0.26647499999999996,7.0177799999999999E-2,1.2191321197958964,54.339999999999996,0.97805703449133763,23.97569384557768,3.0480149052355734,null,97.805703449133759,0.24596454747973043,0.64706361457757444,0.57084985346613526,7.4889801111439142E-2,2.5506002329128301E-2]
["Deadtime","Input Value","Units","Description",null,null,23,24,1,2.99,2.99,2.6300925925925926,0.79368355240526212,1.9662579245522962,3.9731289622761485,2.0068710377238519,0,3.0433995551283424,4.8163860431208037E-2,0.2,0.25009076457423923,0.56760977101825161,2.1360590497902492E-2,2.1360590497902492E-2,1.2315430245696497,0.2017208634416994,0.2017208634416994,2.711331770572154,8.8215839641367186E-2,0.12431195458301694,0.27539999999999992,0,0.49705864997180027,1.3823750873194518,7.8349396163699941E-3,2.4906699999999997E-2,3.2940354759107442E-2,2.4906699999999997E-2,0.13841399999999998,2.7786842556466178E-2,5.2800000000000003E-5,7.0124999999999993E-2,0.2934461538461538,0.26647499999999996,7.0177799999999999E-2,1.2644565658012152,56.81,0.97822697549707549,24.713299378815613,3.1997108726956727,null,97.822697549707556,0.25009076457423923,0.66841300473090759,0.58841188997180027,7.8616974759107436E-2,2.7786842556466178E-2]
["Deadtime",{"$f":"Deadtime*1000000000","v":14},"ns","Total Deadtime",null,null,24,24,1,3.12,3.12,2.7444444444444445,0.79377129898411958,1.9655867594152254,4.102793379707613,2.1372066202923872,0,3.1711765864421739,5.2293076900475001E-2,0.2,0.25440322061282333,0.5674160223319723,2.1346010481056169E-2,2.1346010481056169E-2,1.2830473242915428,0.21894598803743442,0.21894598803743442,2.8253231121946478,9.5789408259615016E-2,0.12971682217358288,0.27539999999999992,0,0.51104608941818142,1.4401077230880295,8.5030320418009332E-3,2.5989599999999998E-2,3.4710742541958467E-2,2.5989599999999998E-2,0.144432,3.0169082827197116E-2,5.2800000000000003E-5,7.0124999999999993E-2,0.2934461538461538,0.26647499999999996,7.0177799999999999E-2,1.3112205339186507,59.28,0.97835956228700438,25.46759079556362,3.35259341345771,null,97.835956228700439,0.25440322061282333,0.69018883196013991,0.60637120941818146,8.2373302541958474E-2,3.0169082827197116E-2]
["IQ","Input Value","Units","Description",null,null,25,24,1,3.25,3.25,2.8587962962962963,0.79385905022395054,1.964915409367826,4.2324577046839131,2.2675422953160869,0,3.2991273159980143,5.6598053445254155E-2,0.2,0.25890228373752522,0.56722222026667912,2.1331431426990507E-2,2.1331431426990507E-2,1.3346055056194281,0.23689585679874869,0.23689585679874869,2.939481801289193,0.10368663912132431,0.13512168976414884,0.27539999999999992,0,0.52543479712401853,1.4978944512394403,9.1991199269210056E-3,2.7072499999999996E-2,3.6510280732486078E-2,2.7072499999999996E-2,0.15045,3.2652723141492784E-2,5.2800000000000003E-5,7.0124999999999993E-2,0.2934461538461538,0.26647499999999996,7.0177799999999999E-2,1.3594276729612618,61.75,0.97845919820401583,26.238735479208778,3.506662375812184,null,97.845919820401576,0.25890228373752522,0.71239507785650458,0.6247317971240185,8.615878073248609E-2,3.2652723141492784E-2]
["IQ ",{"$f":"Iq*1000","v":2.2000000000000001E-3},"mA","Quiescent Current Of Controller (Not Switching!)",null,null,26,24,1,3.38,3.38,2.9731481481481481,0.79394680612512691,1.9642438743953656,4.3621219371976832,2.3978780628023171,0,3.4272322895462324,6.1078790065843214E-2,0.2,0.26358833841000406,0.56702836481811891,2.1316853339500934E-2,2.1316853339500934E-2,1.3862096541816444,0.25556976831107042,0.25556976831107042,3.0537905290223817,0.11190763914176156,0.14052655735471478,0.27539999999999992,0,0.54022891399602901,1.5557263806214485,9.9231667425821977E-3,2.8155399999999994E-2,3.8338966353448418E-2,2.8155399999999994E-2,0.156468,3.5237763499524934E-2,5.2800000000000003E-5,7.0124999999999993E-2,0.2934461538461538,0.26647499999999996,7.0177799999999999E-2,1.4090818039095776,64.22,0.97852961270858996,27.02690734783322,3.6619176385853507,null,97.852961270858998,0.26358833841000406,0.73503588034947742,0.64349779399602902,8.9973406353448415E-2,3.5237763499524934E-2]
["High-side FET","Input Value","Units","Description",null,null,27,24,1,3.51,3.51,3.0874999999999999,0.79403456668801953,1.9635721544831077,4.4917860772415539,2.5282139227584457,0,3.5554748347426748,6.5735286762539938E-2,0.2,0.26846178549412997,0.56683445598203785,2.1302276222384418E-2,2.1302276222384418E-2,1.4378529855447697,0.27496702066932105,0.27496702066932105,3.1682344616462199,0.12045251524755254,0.14593142494528075,0.27539999999999992,0,0.5554327399549579,1.6135958900932219,1.067513595575552E-2,2.9238299999999995E-2,4.0196797176415257E-2,2.9238299999999995E-2,0.16248599999999999,3.792420390146535E-2,5.2800000000000003E-5,7.0124999999999993E-2,0.2934461538461538,0.26647499999999996,7.0177799999999999E-2,1.4601869234186737,66.69,0.97857398505657056,27.832286998108234,3.8183591110801012,null,97.857398505657059,0.26846178549412997,0.75811553713137314,0.66267349995495795,9.3817177176415259E-2,3.792420390146535E-2]
["RdsonTop",{"$f":"Rdson1*1000","v":12},"mW","Drain-Source Resistance of Top FET ",null,null,28,24,1,3.64,3.64,3.2018518518518513,0.79412233191299986,1.9629002496163153,4.6214501248081579,2.6585498751918424,0,3.6838405841135398,7.0567543535642319E-2,0.2,0.27352304234223407,0.56664049375418168,2.1287700079439462E-2,2.1287700079439462E-2,1.489529651446994,0.29508691147779387,0.29508691147779387,3.2828008160802269,0.12932137437668403,0.15133629253584671,0.27539999999999992,0,0.57105073752426105,1.6714964107364938,1.1454991029530423E-2,3.0321199999999996E-2,4.2083771720365454E-2,3.0321199999999996E-2,0.16850399999999999,4.0712044347485959E-2,5.2800000000000003E-5,7.0124999999999993E-2,0.2934461538461538,0.26647499999999996,7.0177799999999999E-2,1.5127472074915798,69.16,0.97859504169195177,28.655061856018964,3.9759867330188743,null,97.859504169195176,0.27352304234223407,0.78163850924462652,0.68226337752426103,9.7690091720365455E-2,4.0712044347485959E-2]
["RdsonTopTc",{"$f":"RdsonTopTc*1000000","v":4000},"ppm","Drain to Source Resistance Temp Co",null,null,29,24,1,3.77,3.77,3.3162037037037031,0.79421010180044005,1.9622281597802513,4.7511140798901259,2.7888859201098741,0,3.8123170923450496,7.5575560385448298E-2,0.2,0.27877254288504638,0.56644647813029614,2.1273124914466122E-2,2.1273124914466122E-2,1.5412345843463306,0.3159287378500325,0.3159287378500325,3.3974785194133932,0.13851432347850506,0.15674116012641265,0.27539999999999992,0,0.58708753558733084,1.7294222511320909,1.2262695423114232E-2,3.1404099999999997E-2,4.3999889250334406E-2,3.1404099999999997E-2,0.17452199999999998,4.3601284837758637E-2,5.2800000000000003E-5,7.0124999999999993E-2,0.2934461538461538,0.26647499999999996,7.0177799999999999E-2,1.5667670153249691,71.63,0.97859513364849926,29.495426334667897,4.1348004744886113,null,97.859513364849931,0.27877254288504638,0.80560942483766518,0.70227205558733086,0.10159214925033441,4.3601284837758637E-2]
["QgTop",{"$f":"Qg_Q1*1000000000","v":8},"nC","Gate Charge Of Top FET",null,null,30,24,1,3.9,3.9,3.4305555555555549,0.79429787635071092,1.9615558849601744,4.880777942480087,2.9192220575199128,0,3.9408935269578764,8.0759337312256152E-2,0.2,0.28421073772535949,0.56625240910612562,2.1258550731265955E-2,2.1258550731265955E-2,1.5929633717775549,0.33749179640871391,0.33749179640871391,3.5122579336960333,0.14803146951372875,0.16214602771697861,0.27539999999999992,0,0.60354793331951395,1.787368456140972,1.3098212591831821E-2,3.2486999999999995E-2,4.5945149776111548E-2,3.2486999999999995E-2,0.18053999999999998,4.6591925372455475E-2,5.2800000000000003E-5,7.0124999999999993E-2,0.2934461538461538,0.26647499999999996,7.0177799999999999E-2,1.6222508933334201,74.099999999999994,0.97857629858865913,30.353581999419589,4.2948003358877402,null,97.85762985886592,0.28421073772535949,0.83003308309562551,0.722704333319514,0.10552334977611155,4.6591925372455475E-2]
["QgdTop",{"$f":"Qgd_Q1*1000000000","v":2.9},"nC","Gate to Drain Charge",null,null,31,24,1,4.03,4.03,3.5449074074074076,0.7943856555641845,1.9608834251413441,5.0104417125706719,3.0495582874293281,0,4.0695604165457686,8.6118874316364072E-2,0.2,0.28983809423545598,0.5660582866774152,2.1243977533642121E-2,2.1243977533642121E-2,1.6447121540913989,0.359775383285524,0.359775383285524,3.627130631946248,0.15787291945443346,0.16755089530754455,0.27539999999999992,0,0.62043690430151766,1.8453306919664516,1.3961505987124869E-2,3.35699E-2,4.7919554050986871E-2,3.35699E-2,0.186558,4.968396595174851E-2,5.2800000000000003E-5,7.0124999999999993E-2,0.2934461538461538,0.26647499999999996,7.0177799999999999E-2,1.6792035793588751,76.570000000000007,0.97854031092270666,31.22973774066374,4.4559863478751662,null,97.85403109227066,0.28983809423545598,0.85491445835250457,0.74356518430151763,0.10948369405098687,4.968396595174851E-2]
["QgsTop",{"$f":"Qgs_Q1*1000000000","v":3.1},"nC",null,null,null,32,{"$f":"Vin","v":24},{"$f":"MODE","v":1},4.16,{"$f":"Iout*G41/100/Number_of_Phases","v":4.16},{"$f":"Vout*K41/(Vin*Efficiency)","v":3.6592592592592594},{"$f":"(Vout+(Rdson2+Rs+Rdcr)*K41)/(Vin+(Rs+Rdson2-Rdson1)*K41)","v":0.79447343944123205},{"$f":"(Vin-(Rdson1+Rdcr)*K41-Vout)*M41/(Fsw*Lf)","v":1.9602107803090167},5.1401053901545088,3.1798946098454919,{"$f":"IF(MIN(Vin, -P41/(Coss_Q1+Coss_Q2)*0.00000002)<0, 0, MIN(Vin, -P41/(Coss_Q1+Coss_Q2)*0.00000002))","v":0},4.1983094445189053,{"$f":"R41^2*Rdcr","v":9.1654171398070514E-2},{"$f":"Core_Loss_Ch1","v":0.2},{"$f":"(T41+S41*(1+Ltc*(Ta-25)))/(1-S41*Ltc*ThetaCa)","v":0.29565509665833883},0.56586411083990862,2.1229405325399259E-2,2.1229405325399259E-2,1.6964775406774053,0.38277879412104004,0.38277879412104004,3.7420892146418301,{"$f":"Rdson1*AB41^2","v":0.16803878028406449},{"$f":"(Vin*K41/2)*Fsw*(Tr_buck+Tf_buck)","v":0.17295576289811052},{"$f":"(0.5*Coss_Q1*(Vin-Q41)^2-0.5*Coss_Q2*(Vin-Q41)^2+(Qoss_Q2*(Vin-Q41)/Vin)*Vin)*Fsw","v":0.27539999999999992},{"$f":"IF(K41>N41/2,0,ABS(K41-N41/2)*Vsd_Q1*Deadtime*Fsw)","v":0},{"$f":"(AF41+AE41+AD41+AC41*(1+RdsonTopTc*Ta-RdsonTopTc*25))/(1-AC41*RdsonTopTc*ThetaJA_Q1)","v":0.63775960082117855},{"$f":"SQRT((1-M41))*SQRT(K41^2+(N41^2)/12)","v":1.9033051519916426},{"$f":"Rdson2*AH41^2","v":1.4852539056551511E-2},{"$f":"IF(K41<N41/2,Deadtime*Fsw*IF(VfdSky_Q2>0,0,Vsd_Q2)*(K41+N41/2),2*Deadtime*Fsw*IF(VfdSky_Q2>0,0,Vsd_Q2)*K41)","v":3.4652799999999997E-2},{"$f":"(AJ41+AI41*(1+RdsonBotTc*Ta-RdsonBotTc*25))/(1-AI41*RdsonBotTc*ThetaJA_Q2)","v":4.9923103570547162E-2},{"$f":"2*Deadtime*Fsw*IF(VfdSky_Q2>0,VfdSky_Q2,Vsd_Q2)*K41","v":3.4652799999999997E-2},{"$f":"IF(QrrSky_Q2>0,QrrSky_Q2,Qrr_Q2*K41/(Iout/Number_of_Phases))*Fsw*Vin","v":0.192576},{"$f":"Rs*R41^2","v":5.2877406575809915E-2},{"$f":"Iq*Vin","v":5.2800000000000003E-5},{"$f":"IF(Ext_VCC=1,  (Qg_Q1+Qg_Q2)*Fsw*VCC, (Qg_Q1+Qg_Q2)*Fsw*Vin)","v":7.0124999999999993E-2},0.2934461538461538,{"$f":"(Qg_Q1+Qg_Q2)*Fsw*(Vin-VCC)","v":0.26647499999999996},{"$f":"SUM(AO41:AP41)","v":7.0177799999999999E-2},{"$f":" SUM(U41,X41,AA41,AG41,AK41,AL41,AM41,AS41,AN41)","v":1.7376300070723139},{"$f":"Vout*K41","v":79.040000000000006},0.97848872259658792,{"$f":"ThetaJA_Q1*BC41","v":32.124109954489498},{"$f":"ThetaJA_Q2*BD41","v":4.61835857132127},null,97.848872259658791,{"$f":"U41","v":0.29565509665833883},{"$f":"AG41+AK41+AM41","v":0.88025870439172571},{"$f":"AG41+AM41*0.66","v":0.76485976082117857},{"$f":"AK41+AM41*0.33","v":0.11347318357054717},{"$f":"AN41","v":5.2877406575809915E-2}]
["RGateTop",{"$f":"Rgate1","v":1.2},"W","Gate Resistance",null,null,33,24,1,{"$f":"Iout*G42/100","v":4.29},4.29,3.7736111111111112,0.79456122798222562,1.959537950448448,5.2697689752242241,3.310231024775776,0,4.3271332790818109,9.7365228557673988E-2,0.2,0.30166224621280596,0.5656698815893495,2.1214834110343563E-2,2.1214834110343563E-2,1.7482565409048525,0.40650132406460782,0.40650132406460782,3.8571271584500528,0.17852915899743574,0.17836063048867648,0.27539999999999992,0,0.65552135837095105,1.9612884791596374,1.5771275243785726E-2,3.5735699999999995E-2,5.1955800571521098E-2,3.5735699999999995E-2,{"$f":"IF(QrrSky_Q2>0,QrrSky_Q2,Qrr_Q2*K42/(Iout/Number_of_Phases))*Fsw*Vin","v":0.19859400000000002},5.6172247244811922E-2,5.2800000000000003E-5,7.0124999999999993E-2,0.2934461538461538,0.26647499999999996,7.0177799999999999E-2,1.7975353105750413,81.510000000000005,0.97842289651381797,33.036922731579949,4.7819170972609095,null,97.842289651381805,0.30166224621280596,0.90607115894247214,0.7865933983709511,0.11749182057152111,5.6172247244811922E-2]
["GfsTop",{"$f":"Gfs_Q1","v":55},"S","Transconductance of Top FET",null,null,34,24,1,4.42,4.42,3.8879629629629631,0.79464902118753666,1.9588649355448919,5.3994324677724457,3.4405675322275542,0,4.4560254322631065,0.10325204579547315,0.2,0.30786006120241211,0.56547559892148114,2.1200263892282797E-2,2.1200263892282797E-2,1.8000465068641591,0.43094226777422356,0.43094226777422356,3.9722386908049203,0.18934416260073103,0.18376549807924242,0.27539999999999992,0,0.67372770034889218,2.0192777016170953,1.6717677988616876E-2,3.6818599999999993E-2,5.4017648030673229E-2,3.6818599999999993E-2,0.20461200000000002,5.9568487958926816E-2,5.2800000000000003E-5,7.0124999999999993E-2,0.2934461538461538,0.26647499999999996,7.0177799999999999E-2,1.8589248292074108,83.98,0.97834403409751358,33.968408054653473,4.9466620468484006,null,97.83440340975136,0.30786006120241211,0.93235734837956541,0.80877162034889216,0.12153960803067324,5.9568487958926816E-2]
["VthTop",{"$f":"Vth_Q1","v":3.1},"V","Threshold Voltage of Top FET",null,null,35,24,1,4.55,4.55,4.0023148148148149,0.79473681905753701,1.9581917355836005,5.5290958677918001,3.5709041322081996,0,4.5849801423898215,0.10931462311176673,0.2,0.31424907712836264,0.56528126283204616,2.1185694675026224E-2,2.1185694675026224E-2,1.8518450856310904,0.45610091941641073,0.45610091941641073,4.0874186853431249,0.20048389811150544,0.18917036566980835,0.27539999999999992,0,0.6923843429713491,2.0772701790611809,1.7691710726949167E-2,3.7901499999999991E-2,5.6108649663746624E-2,3.7901499999999991E-2,0.21062999999999998,6.3066128718326966E-2,5.2800000000000003E-5,7.0124999999999993E-2,0.2934461538461538,0.26647499999999996,7.0177799999999999E-2,1.9218041125732221,86.45,0.97825319815667544,34.918806004796664,5.1125935713144885,null,97.825319815667541,0.31424907712836264,0.95912299263509571,0.83140014297134912,0.12561654966374664,6.3066128718326966E-2]
["VspTop",{"$f":"Vsp_Q1","v":3.3363636363636364},"V",null,null,null,36,24,1,4.68,4.68,4.1166666666666663,0.79482462159259837,1.9575183505498244,5.6587591752749118,3.7012408247250876,0,4.7139922755977164,0.11555296050685365,0.2,0.32082984680638582,0.56508687331678664,2.1171126462384657E-2,2.1171126462384657E-2,1.9036501792630609,0.48197657266610178,0.48197657266610178,4.2026625742764461,0.2119484725586871,0.19457523326037432,0.27539999999999992,0,0.71149720040601572,2.1352635577771206,1.8693336890801125E-2,3.8984399999999995E-2,5.822880992445393E-2,3.8984399999999995E-2,0.21664799999999995,6.6665169523184811E-2,5.2800000000000003E-5,7.0124999999999993E-2,0.2934461538461538,0.26647499999999996,7.0177799999999999E-2,1.9861789257885265,88.919999999999987,0.97815133196380477,35.88836497705266,5.279711851925275,null,97.815133196380472,0.32082984680638582,0.98637401033046956,0.85448488040601567,0.12972264992445393,6.6665169523184811E-2]
["VsdTop",{"$f":"Vsd_Q1","v":0.7},"V",null,null,null,37,24,1,4.8099999999999996,4.8099999999999996,4.2310185185185176,0.79491242879309265,1.9568447804288125,5.7884223902144054,3.8315776097855934,0,4.8430572428881069,0.12196705798103295,0.2,0.32760294048763056,0.56489243037144454,2.115655925817047E-2,2.115655925817047E-2,1.9554599111101116,0.50856852070651581,0.50856852070651581,4.3179662745959746,0.22373799298257888,0.19998010085094028,0.27539999999999992,0,0.73107239013450742,2.1932557327732463,1.9722519908305106E-2,4.0067299999999993E-2,6.0378134003516659E-2,4.0067299999999993E-2,0.22266599999999998,7.0365610373672866E-2,5.2800000000000003E-5,7.0124999999999993E-2,0.2934461538461538,0.26647499999999996,7.0177799999999999E-2,2.0520552549640136,91.389999999999986,0.97803927525604162,36.87734190564931,5.4480170999431285,null,97.803927525604166,0.32760294048763056,1.0141165241380241,0.87803195013450741,0.13385791400351665,7.0365610373672866E-2]
["θJATop",{"$f":"ThetaJA_Q1","v":42},"°C/W","Junction to Ambient Resistance",null,null,38,24,1,4.9400000000000004,4.9400000000000004,4.3453703703703708,0.79500024065939168,1.9561710252058129,5.9180855126029073,3.961914487397094,0,4.9721709299514805,0.12855691553460374,0.2,0.33456894598364151,0.56469793399176116,2.1141993066197556E-2,2.1141993066197556E-2,2.0072725973114824,0.53587605622903878,0.53587605622903878,4.43332612563505,0.23585256643485938,0.20538496844150625,0.27539999999999992,0,0.75111623855411569,2.2512448157444549,2.0779223203706766E-2,4.1150199999999998E-2,6.2556627827752564E-2,4.1150199999999998E-2,0.22868400000000005,7.4167451269963713E-2,5.2800000000000003E-5,7.0124999999999993E-2,0.2934461538461538,0.26647499999999996,7.0177799999999999E-2,2.1194393129307096,93.860000000000014,0.97791777772299227,37.886002499272863,5.6175095565895301,null,97.791777772299227,0.33456894598364151,1.0423568663818683,0.90204767855411572,0.13802234782775258,7.4167451269963713E-2]
["Low-side FET","Input Value","Units","Description",null,null,39,24,1,5.07,5.07,4.4597222222222221,0.79508805719186737,1.9554970848660711,6.0477485424330357,4.0922514575669648,0,5.1013296375301325,0.13532253316786522,0.2,0.34172846879546076,0.56450338417347734,2.1127427890281356E-2,2.1127427890281356E-2,2.0590867225728871,0.56389847143310179,0.56389847143310179,4.5487388360088765,0.24829229997858468,0.21078983603207219,0.27539999999999992,0,0.77163528682894245,2.3092291078470168,2.1863410197364506E-2,4.2233099999999996E-2,6.4764298059210773E-2,4.2233099999999996E-2,0.23470199999999999,7.8070692212229939E-2,5.2800000000000003E-5,7.0124999999999993E-2,0.2934461538461538,0.26647499999999996,7.0177799999999999E-2,2.1883375452192273,96.330000000000013,0.97778751042957057,38.914621486815584,5.7881894930098792,null,97.778751042957055,0.34172846879546076,1.0711015848881533,0.92653860682894251,0.14221595805921078,7.8070692212229939E-2]
["RdsonBot",{"$f":"Rdson2*1000","v":4.0999999999999996},"mW","Drain-Source Resistance of Low-side FET",null,null,40,24,1,5.2,5.2,4.5740740740740735,0.79517587839089177,1.9548229593948323,6.1774114796974162,4.2225885203025841,0,5.2305300305241316,0.14226391088111681,0.2,0.34908213224691237,0.56430878091233372,2.111286373423887E-2,2.111286373423887E-2,2.1109009194951045,0.59263505802606198,0.59263505802606198,4.6642014383331638,0.26105730068818983,0.21619470362263818,0.27539999999999992,0,0.79263629700119065,2.3672070764649251,2.297504430574903E-2,4.3315999999999993E-2,6.7001152094354782E-2,4.3315999999999993E-2,0.24072000000000002,8.2075333200644321E-2,5.2800000000000003E-5,7.0124999999999993E-2,0.2934461538461538,0.26647499999999996,7.0177799999999999E-2,2.2587566363034033,98.8,0.97764907553303515,39.963482874050008,5.9600572102402412,null,97.764907553303516,0.34908213224691237,1.1003574490955454,0.95151149700119064,0.14643875209435481,8.2075333200644321E-2]
["RdsonBotTc",{"$f":"RdsonBotTc*1000000","v":4000},"ppm","Drain To Source Resitance Temp Co",null,null,41,24,1,5.33,5.33,4.6884259259259258,0.79526370425683646,1.9541486487773381,6.3070743243886689,4.3529256756113313,0,5.3597690943851788,0.1493810486746579,0.2,0.35663057762212241,0.56411412420406981,2.1098300601888588E-2,2.1098300601888588E-2,2.1627139508627229,0.62208510722308097,0.62208510722308097,4.7797112504269066,0.2741476756494905,0.22159957121320409,0.27539999999999992,0,0.814126258373983,2.4251773353033328,2.4114088941442791E-2,4.4398899999999991E-2,6.926719806329279E-2,4.4398899999999991E-2,0.24673800000000001,8.6181374235379568E-2,5.2800000000000003E-5,7.0124999999999993E-2,0.2934461538461538,0.26647499999999996,7.0177799999999999E-2,2.3307035161197476,101.27,0.97750301458370781,41.032880211707287,6.1331130391760178,null,97.750301458370785,0.35663057762212241,1.130131456437276,0.97697333837398304,0.15069073806329281,8.6181374235379568E-2]
["QgBot",{"$f":"Qg_Q2*1000000000","v":25},"nC","Gate Charge Of Top FET",null,null,42,24,1,5.46,5.46,4.8027777777777771,0.79535153479007392,1.9534741529988306,6.4367370764994156,4.4832629235005843,0,5.489044097612644,0.15667394654878825,0.2,0.36437446430733444,0.56391941404442558,2.108373849705061E-2,2.108373849705061E-2,2.2145246944114034,0.65224790974700331,0.65224790974700331,4.8952658419443438,0.28756353195968476,0.22700443880377005,0.27539999999999992,0,0.83611239417773109,2.4831386272677443,2.5280507513139462E-2,4.5481799999999996E-2,7.1562444829055424E-2,4.5481799999999996E-2,0.25275600000000004,9.0388815316608612E-2,5.2800000000000003E-5,7.0124999999999993E-2,0.2934461538461538,0.26647499999999996,7.0177799999999999E-2,2.4041853668747839,103.74,0.97734981564402235,42.12311687546471,6.3073573405425574,null,97.734981564402233,0.36437446430733444,1.1604308390067866,1.0029313541777312,0.15497192482905545,9.0388815316608612E-2]
["RGateBot",{"$f":"Rgate2","v":1.2},"W","Gate Resistance",null,null,43,24,1,5.59,5.59,4.9171296296296294,0.79543936999097609,1.9527994720445498,6.5663997360222748,4.6136002639777249,0,5.6183525593808596,0.16414260450380758,0.2,0.37231446993707784,0.56372465042914,2.1069177423546536E-2,2.1069177423546536E-2,2.2663321296793226,0.68312275582823634,0.68312275582823634,5.0108630055722747,0.30130497672735373,0.23240930639433599,0.27539999999999992,0,0.85860216853274973,2.541089809685726,2.6474263425643418E-2,4.6564699999999994E-2,7.3886901986920647E-2,4.6564699999999994E-2,0.25877399999999995,9.4697656444504369E-2,5.2800000000000003E-5,7.0124999999999993E-2,0.2934461538461538,0.26647499999999996,7.0177799999999999E-2,2.4792096301530355,106.21,0.97718991941712263,43.234506358375484,6.4827905048676699,null,97.718991941712261,0.37231446993707784,1.1912630705196703,1.0293930085327496,0.15928232198692063,9.4697656444504369E-2]
["VsdBot",{"$f":"Vsd_Q2","v":0.7},"V","Diode Forward Voltage of Bottom FET Body Diode",null,null,44,24,1,5.72,5.72,5.0314814814814808,0.79552720985991476,1.9521246058997328,6.6960623029498665,4.743937697050133,0,5.7476922214989843,0.17178702254001563,0.2,0.38045129054475102,0.56352983335395146,2.1054617385199509E-2,2.1054617385199509E-2,2.3181353266183624,0.71470893520463097,0.71470893520463097,5.1265007320821327,0.31537211707246371,0.23781417398490196,0.27539999999999992,0,0.88160329372152957,2.5990298415064976,2.7695320079869287E-2,4.7647599999999991E-2,7.6240579863785782E-2,4.7647599999999991E-2,0.26479199999999997,9.9107897619239799E-2,5.2800000000000003E-5,7.0124999999999993E-2,0.2934461538461538,0.26647499999999996,7.0177799999999999E-2,2.5557840143391366,108.67999999999999,0.97702372454164854,44.367372576304241,6.6594129524560808,null,97.702372454164859,0.38045129054475102,1.2226358735853153,1.0563660137215296,0.16362193986378576,9.9107897619239799E-2]
["QrrBot",{"$f":"Qrr_Q2*1000000000","v":59},"nC","Reverse Recovery Charge of Body Diode",null,null,45,24,1,5.85,5.85,5.145833333333333,0.79561505439726232,1.9514495545496167,6.8257247772748082,4.8742752227251911,0,5.8770610240433374,0.17960720065771246,0.2,0.38878564071768418,0.56333496281459827,2.1040058385834236E-2,2.1040058385834236E-2,2.3699334356969315,0.74700573712135687,0.74700573712135687,5.242177188649511,0.32976506012636753,0.24321904157546789,0.27539999999999992,0,0.90512373778484978,2.6569577721770492,2.8943640872841313E-2,4.8730499999999989E-2,7.8623489517586145E-2,4.8730499999999989E-2,0.27081,0.10361953884098797,5.2800000000000003E-5,7.0124999999999993E-2,0.2934461538461538,0.26647499999999996,7.0177799999999999E-2,2.6339165023682996,111.14999999999999,0.97685159218162898,45.522050186963696,6.8372251333657568,null,97.685159218162894,0.38878564071768418,1.2545572273024359,1.0838583377848499,0.16799078951758614,0.10361953884098797]
["TrrBot",{"$f":"Trr_Q2*1000000000","v":40},"ns","Reverse Recovery Time of Body Diode",null,null,46,24,1,5.98,5.98,5.2601851851851853,0.79570290360339124,1.9507743179794375,6.9553871589897192,5.0046128410102817,0,6.0064570841143405,0.1876031388571982,0.2,0.39731825375674423,0.5631400388068184,2.1025500429276967E-2,2.1025500429276967E-2,2.4217256792719106,0.7800124503307847,0.7800124503307847,5.3578906999537184,0.34448391303180653,0.24862390916603389,0.27539999999999992,0,0.92917173245671547,2.7148727319446868,3.0219189197692908E-2,4.9813399999999994E-2,8.1035642736760713E-2,4.9813399999999994E-2,0.27682799999999996,0.10823258010992205,5.2800000000000003E-5,7.0124999999999993E-2,0.2934461538461538,0.26647499999999996,7.0177799999999999E-2,2.7136153598202046,113.62,0.9766738500180967,46.69888492318205,7.0162275273861612,null,97.667385001809663,0.39731825375674423,1.2870353751934762,1.1118782124567155,0.1723888827367607,0.10823258010992205]
["θJABot",{"$f":"ThetaJA_Q2","v":40.700000000000003},"°C/W","Junction to Ambient Resistance",null,null,47,24,1,6.11,6.11,5.3745370370370367,0.79579075747867301,1.9500988961744266,7.0850494480872133,5.1349505519127874,0,6.1358786772614504,0.19577483713877294,0.2,0.40604988184055257,0.56294506132634869,2.1010943519355466E-2,2.1010943519355466E-2,2.4735113440442378,0.81372836309236574,0.81372836309236574,5.4736397316510734,0.35952878294291085,0.25402877675659985,0.27539999999999992,0,0.95375578145396123,2.7727739233775437,3.1521928443666233E-2,5.0896299999999998E-2,8.3477052039764313E-2,5.0896299999999998E-2,0.28284600000000004,0.11294702142621517,5.2800000000000003E-5,7.0124999999999993E-2,0.2934461538461538,0.26647499999999996,7.0177799999999999E-2,2.7948891433722145,116.09,0.97649079573097264,47.89823394106638,7.1964206440184082,null,97.649079573097268,0.40604988184055257,1.3200788334937257,1.1404341414539614,0.17681623203976432,0.11294702142621517]
["Bottom Schottky","Input Value","Units","Std Units",null,null,48,24,1,6.24,6.24,5.4888888888888889,0.79587861602348053,1.9494232891198173,7.2147116445599089,5.2652883554400916,0,6.2653242211940023,0.20412229550273717,0.2,0.41498129619438384,0.56275003036892612,2.0996387659899068E-2,2.0996387659899068E-2,2.5252897744429394,0.84815276317250754,0.84815276317250754,5.5894228758820477,0.3748997770252025,0.25943364434716576,0.27539999999999992,0,0.97888466913728955,2.8306606139286092,3.2851821996111433E-2,5.1979199999999996E-2,8.5947730674625925E-2,5.1979199999999996E-2,0.28886400000000001,0.11776286279004068,5.2800000000000003E-5,7.0124999999999993E-2,0.2934461538461538,0.26647499999999996,7.0177799999999999E-2,2.877746709628747,118.56,0.97630270004507114,49.120466183766162,7.3778050224572764,null,97.630270004507111,0.41498129619438384,1.3536963998119156,1.1695349091372895,0.18127285067462595,0.11776286279004068]
["VfdSky",{"$f":"VfdSky_Q2","v":0},"V","Diode Forward Voltage",null,null,49,24,1,6.37,6.37,5.6032407407407403,0.79596647923818598,1.94874749680084,7.3443737484004199,5.3956262515995803,0,6.394792261457023,0.21264551394939127,0.2,0.42411328726381753,0.56255494593028721,2.0981832854738661E-2,2.0981832854738661E-2,2.5770603668072747,0.88328493784445639,0.88328493784445639,5.7052388385266557,0.39059700245559581,0.26483851193773172,0.27539999999999992,0,1.0045674695614575,2.8885321293968049,3.4208833236486318E-2,5.3062099999999994E-2,8.8447692618553883E-2,5.3062099999999994E-2,0.29488199999999998,0.12268010420157188,5.2800000000000003E-5,7.0124999999999993E-2,0.2934461538461538,0.26647499999999996,7.0177799999999999E-2,2.962197224344596,121.03,0.97610980940207914,50.365962761581216,7.5603812315751435,null,97.610980940207909,0.42411328726381753,1.3878971621800114,1.1991895895614575,0.18575875261855387,0.12268010420157188]
["QrrSky",{"$f":"QrrSky_Q2*1000000000","v":0},"nC","Diode Reverse Recovery Charge",null,null,50,24,1,6.5,6.5,5.7175925925925926,0.79605434712316137,1.9480715192027225,7.4740357596013611,5.5259642403986389,0,6.524281458801477,0.22134449247903579,0.2,0.4334466648932182,0.56235980800616758,2.0967279107706641E-2,2.0967279107706641E-2,2.6288225642570815,0.91912417388817458,0.91912417388817458,5.8210864279674297,0.40662056642239935,0.27024337952829769,0.27539999999999992,0,1.0308135559333844,2.9463878481615629,3.5592925542355908E-2,5.4144999999999992E-2,9.0976952577586992E-2,5.4144999999999992E-2,0.3009,0.12769874566098219,5.2800000000000003E-5,7.0124999999999993E-2,0.2934461538461538,0.26647499999999996,7.0177799999999999E-2,3.0482501720610533,123.5,0.97591234831049412,51.63511734920214,7.7441498699077913,null,97.591234831049405,0.4334466648932182,1.4226905085109713,1.2294075559333844,0.190273952577587,0.12769874566098219]
["Ireverse",{"$f":"Ireverse","v":0},"mA","Reverse Leakage Current",null,null,51,24,1,6.63,6.63,5.8319444444444439,0.79614221967877929,1.9473953563106925,7.6036976781553465,5.6563023218446533,0,6.6537905780200486,0.23021923109197151,0.2,0.44298225850911932,0.56216461659230277,2.0952726422636982E-2,2.0952726422636982E-2,2.6805758521583729,0.9556697575902201,0.9556697575902201,5.9369645451563118,0.42297057612531708,0.27564824711886365,0.27539999999999992,0,1.0576326104980205,3.0042271960864215,3.7004062287391656E-2,5.5227899999999989E-2,9.3535525986291501E-2,5.5227899999999989E-2,0.30691799999999997,0.13281878716844511,5.2800000000000003E-5,7.0124999999999993E-2,0.2934461538461538,0.26647499999999996,7.0177799999999999E-2,3.1359153661747334,125.97,0.97571052141739167,52.928336600916857,7.9291115656420645,null,97.571052141739173,0.44298225850911932,1.4580861364843121,1.2601984904980204,0.19481846598629149,0.13281878716844511]
["Controller","Input Value","Units","Std Units",null,null,52,24,1,6.76,6.76,5.9462962962962962,0.79623009690541235,1.9467190081099759,7.7333595040549881,5.7866404959450115,0,6.7833184780541878,0.23926972978849917,0.2,0.45272091730859143,0.56196937168442795,2.0938174803365208E-2,2.0938174803365208E-2,2.7323197541052648,0.99292097474362273,0.99292097474362273,6.0528721748126211,0.43964713877545047,0.28105311470942956,0.27539999999999992,0,1.085034634873012,3.062049642002969,3.844220684137109E-2,5.6310799999999987E-2,9.6123429007504424E-2,5.6310799999999987E-2,0.31293599999999999,0.13804022872413416,5.2800000000000003E-5,7.0124999999999993E-2,0.2934461538461538,0.26647499999999996,7.0177799999999999E-2,3.2252029594602303,128.44,0.97550451533915705,54.246040584666503,8.1152669766054313,null,97.550451533915705,0.45272091730859143,1.4940940638805165,1.291572394873012,0.19939230900750443,0.13804022872413416]
["θJA",30,"°C/W","Junction to Ambient Resistance",null,null,53,24,1,6.89,6.89,6.0606481481481476,0.79631797880343258,1.9460424745857956,7.8630212372928971,5.9169787627071022,0,6.9128641032069815,0.24849598856891983,0.2,0.46266351045267456,0.56177407327827733,2.0923624253728342E-2,2.0923624253728342E-2,2.784053828351055,1.0308771106477701,1.0308771106477701,6.1688083776048916,0.45665036159529959,0.28645798229999553,0.27539999999999992,0,1.1130299608544172,3.1198546936995908,3.99073225701774E-2,5.7393699999999992E-2,9.874067853212283E-2,5.7393699999999992E-2,0.31895399999999996,0.14336307032822299,5.2800000000000003E-5,7.0124999999999993E-2,0.2934461538461538,0.26647499999999996,7.0177799999999999E-2,3.316123455068936,130.91,0.97529450028273379,55.588663235885519,8.3026167902573995,null,97.529450028273374,0.46266351045267456,1.5307246393865399,1.3235396008544171,0.20399549853212282,0.14336307032822299]
["Theta Ja",2,"°C/W","Junction to Ambient Resistance",null,null,54,24,1,7.02,7.02,6.1749999999999998,0.79640586537321278,1.9453657557233752,7.9926828778616876,6.0473171221383115,0,7.0424264753204975,0.25789800743353447,0.2,0.47281092726495999,0.5615787213695852,2.0909074777565009E-2,2.0909074777565009E-2,2.8357776646310136,1.0695374501082766,1.0695374501082766,6.2847722831908319,0.47398035181876447,0.29186284989056149,0.27539999999999992,0,1.1416292617170634,3.1776418943504918,4.1399372835798656E-2,5.847659999999999E-2,0.10138729217893833,5.847659999999999E-2,0.32497199999999998,0.14878731198088527,5.2800000000000003E-5,7.0124999999999993E-2,0.2934461538461538,0.26647499999999996,7.0177799999999999E-2,3.4086877180276884,133.38,0.97508063148427693,56.956652832116667,8.4911617236827901,null,97.508063148427695,0.47281092726495999,1.5679885538960017,1.3561107817170635,0.20862805217893832,0.14878731198088527]
[null,null,null,null,null,null,55,24,1,7.15,7.15,6.2893518518518512,0.79649375661512556,1.9446888515079352,8.1223444257539672,6.1776555742460326,0,7.1720046867965452,0.26747578638264435,0.2,0.48316407743540768,0.5613833159540853,2.0894526378715368E-2,2.0894526378715368E-2,2.8874908813277504,1.1089012774368709,1.1089012774368709,6.4007630840076892,0.49163721669114746,0.29726771748112751,0.27539999999999992,0,1.1708435640345498,3.2354108193297466,4.2918320996327523E-2,5.9559499999999994E-2,0.10406328829451796,5.9559499999999994E-2,0.33099000000000001,0.15431295368229483,5.2800000000000003E-5,7.0124999999999993E-2,0.2934461538461538,0.26647499999999996,7.0177799999999999E-2,3.5029069872623571,135.85,0.97486305048819299,58.350472489451093,8.680902523586882,null,97.486305048819304,0.48316407743540768,1.6058968523290678,1.3892969640345498,0.21328998829451795,0.15431295368229483]
[null,null,null,null,null,null,56,24,1,7.28,7.28,6.4037037037037026,0.79658165252954316,1.9440117619246935,8.2520058809623471,6.3079941190376534,0,7.3015978943567639,0.27722932541655065,0.2,0.49372389122948851,0.56118785702751028,2.0879979061021074E-2,2.0879979061021074E-2,2.9391931229368593,1.1489678764512705,1.1489678764512705,6.5167800297204117,0.50962106346915326,0.30267258507169342,0.27539999999999992,0,1.2006842600453904,3.29316107336285,4.4464130405960665E-2,6.0642399999999992E-2,0.10676868595313015,6.0642399999999992E-2,0.33700799999999997,0.15993999543262538,5.2800000000000003E-5,7.0124999999999993E-2,0.2934461538461538,0.26647499999999996,7.0177799999999999E-2,3.5987928881729259,138.32,0.97464188628627457,59.770600681906394,8.8718399662923968,null,97.464188628627454,0.49372389122948851,1.6444609459985204,1.4231095400453904,0.21798132595313013,0.15993999543262538]
["Outputs",null,null,null,null,null,57,24,1,7.41,7.41,6.5180555555555548,0.79666955311683818,1.9433344869588698,8.3816672434794341,6.4383327565205652,0,7.4312053134524314,0.28715862453555496,0.2,0.50449131970274341,0.56099234458559344,2.0865432828325411E-2,2.0865432828325411E-2,2.9908840577964444,1.1897365304750631,1.1897365304750631,6.6328224222478873,0.52793199942089197,0.30807745266225933,0.27539999999999992,0,1.2311631205934179,3.3508922879748493,4.603676441499821E-2,6.172529999999999E-2,0.10950350495671646,6.172529999999999E-2,0.34302600000000005,0.16566843723205096,5.2800000000000003E-5,7.0124999999999993E-2,0.2934461538461538,0.26647499999999996,7.0177799999999999E-2,3.6963574457883177,140.79,0.97441725633387077,61.217531784923558,9.0639748577383621,null,97.44172563338708,0.50449131970274341,1.6836926255501345,1.457560280593418,0.22270208495671648,0.16566843723205096]
["Design","Value","Units",null,null,null,58,24,1,7.54,7.54,6.6324074074074062,0.79675745837738388,1.9426570265956806,8.5113285132978405,6.5686714867021596,0,7.5608262132464814,0.29726368373995865,0.2,0.51546733492085317,0.56079677862406707,2.0850887684473175E-2,2.0850887684473175E-2,3.0425633760490536,1.231206522337577,1.231206522337577,6.7488896112982895,0.54657013182587977,0.3134823202528253,0.27539999999999992,0,1.2622923086722597,3.4086041191996972,4.7636186369843084E-2,6.2808199999999995E-2,0.11226776583490854,6.2808199999999995E-2,0.34904399999999997,0.17149827908074539,5.2800000000000003E-5,7.0124999999999993E-2,0.2934461538461538,0.26647499999999996,7.0177799999999999E-2,3.7956130985308172,143.26,0.9741892674576953,62.691776644234906,9.2573080334807774,null,97.418926745769525,0.51546733492085317,1.7236040745071681,1.4926613486722597,0.22745228583490854,0.17149827908074539]
["Dmax",{"$f":"D1_Vinmin","v":0.79166666666666663},"index",null,null,null,59,24,1,7.67,7.67,6.7467592592592585,0.79684536831155228,1.9419793808203387,8.6409896904101693,6.6990103095898306,0,7.6904599121006809,0.30754450303006359,0.2,0.52665293018531856,0.56060115913866271,2.0836343633310689E-2,2.0836343633310689E-2,3.0942307878088013,1.2733771343737754,1.2733771343737754,6.8649809903538745,0.56553556797504079,0.31888718784339126,0.27539999999999992,0,1.2940843936055519,3.4662962455202169,4.9262359613000954E-2,6.3891099999999992E-2,0.11506148984509101,6.3891099999999992E-2,0.35506199999999999,0.17742952097888284,5.2800000000000003E-5,7.0124999999999993E-2,0.2934461538461538,0.26647499999999996,7.0177799999999999E-2,3.8965727126219303,145.72999999999999,0.97395801666789616,64.193863171433179,9.4518403586952058,null,97.395801666789623,0.52665293018531856,1.7642078834506429,1.5284253136055519,0.23223194984509102,0.17742952097888284]
["Dprime",{"$f":"1-B68","v":0.20833333333333337},"index",null,null,null,60,24,1,7.8,7.8,6.8611111111111098,0.79693328291971621,1.9413015496180579,8.7706507748090292,6.8293492251909704,0,7.8201057735096597,0.31800108240617136,0.2,0.53804912026484764,0.56040548612511176,2.0821800678685842E-2,2.0821800678685842E-2,3.145886021509956,1.3162476484241215,1.3162476484241215,6.9810959930533576,0.58482841517070772,0.32429205543395723,0.27539999999999992,0,1.3265523658964966,3.5239683660120256,5.0915247483079198E-2,6.497399999999999E-2,0.11788469897250878,6.497399999999999E-2,0.36107999999999996,0.18346216292663733,5.2800000000000003E-5,7.0124999999999993E-2,0.2934461538461538,0.26647499999999996,7.0177799999999999E-2,3.9992495971632978,148.19999999999999,0.97372359188531876,65.72433696765286,9.6475727281811086,null,97.372359188531874,0.53804912026484764,1.8055170648690053,1.5648651658964967,0.23704109897250877,0.18346216292663733]
["Ipp",{"$f":"Iripple_Vinnom","v":1.9895288012632371},"A",null,null,null,61,24,1,7.93,7.93,6.9754629629629621,0.79702120220224892,1.9406235329740502,8.9003117664870253,6.9596882335129742,0,7.9497632024311091,0.32863342186858413,0.2,0.54965694163255807,0.56020975957914532,2.0807258824448088E-2,2.0807258824448088E-2,3.1975288224164471,1.3598173458344602,1.3598173458344602,7.0972340899267801,0.60444878072662578,0.32969692302452319,0.27539999999999992,0,1.3597096527824679,3.5816201986683232,5.2594813314786562E-2,6.6056899999999988E-2,0.12073741593042023,6.6056899999999988E-2,0.36709800000000004,0.18959620492418316,5.2800000000000003E-5,7.0124999999999993E-2,0.2934461538461538,0.26647499999999996,7.0177799999999999E-2,4.1036575199285377,150.66999999999999,0.97348607259345699,67.283761976863659,9.8445060663681048,null,97.348607259345698,0.54965694163255807,1.847545068712888,1.6019943327824679,0.24187975593042024,0.18959620492418316]
["Top FET","Value","Units",null,null,null,62,24,1,8.06,8.06,7.0898148148148152,0.79710912615952267,1.9399453308735246,9.0299726654367625,7.0900273345632385,0,8.0794316419678616,0.33944152141760375,0.2,0.56147745270909644,0.56001397949649356,2.079271807444839E-2,2.079271807444839E-2,3.2491589512742967,1.4040855074559029,1.4040855074559029,7.213394785443433,0.62439677196795018,0.3351017906150891,0.27539999999999992,0,1.3935701345325984,3.6392514788853196,5.4301020438932833E-2,6.7139799999999999E-2,0.12361966416029567,6.7139799999999999E-2,0.373116,0.19583164697169447,5.2800000000000003E-5,7.0124999999999993E-2,0.2934461538461538,0.26647499999999996,7.0177799999999999E-2,4.2098107239040363,153.14000000000001,0.97324553042335182,68.872721170369132,10.042641327324034,null,97.324553042335182,0.56147745270909644,1.8903057986928939,1.6398266945325983,0.24674794416029566,0.19583164697169447]
["Tr",{"$f":"(Qgd_Q1+Qgs_Q1/2)*(RdsonDRT+Rgate1)/(VCC-Vsp_Q1)*1000000000","v":5.8846994535519128},"ns","Turn on of MOSFET -> Rise time of current",null,null,63,24,1,8.19,8.19,7.2041666666666657,0.7971970547919105,1.9392669433016896,9.1596334716508441,7.2203665283491549,0,8.2091105703631833,0.35042538105353244,0.2,0.57351173411178669,0.55981814587288659,2.0778178432539297E-2,2.0778178432539297E-2,3.3007761830912439,1.4490514136446992,1.4490514136446992,7.3295776153384837,0.64467249623125167,0.34050665820565507,0.27539999999999992,0,1.4281481615287028,3.6968619580906159,5.6033832182428078E-2,6.8222699999999983E-2,0.12653146783206032,6.8222699999999983E-2,0.37913399999999997,0.20216848906934565,5.2800000000000003E-5,7.0124999999999993E-2,0.2934461538461538,0.26647499999999996,7.0177799999999999E-2,4.3177239446191331,155.60999999999999,0.97300202967864213,70.491817264205523,10.241979494764855,null,97.300202967864209,0.57351173411178669,1.9338136293607633,1.6783766015287029,0.25164568783206032,0.20216848906934565]
["Tf",{"$f":"(Qgd_Q1+Qgs_Q1/2)*(RdsonDRT2+Rgate1)/(Vsp_Q1)*1000000000","v":2.2674386920980929},"ns","Turn off of MOSFET -> Fall time of current",null,null,64,{"$f":"Vin","v":24},{"$f":"MODE","v":1},8.32,{"$f":"Iout*G73/100/Number_of_Phases","v":8.32},{"$f":"Vout*K73/(Vin*Efficiency)","v":7.3185185185185189},{"$f":"(Vout+(Rdson2+Rs+Rdcr)*K73)/(Vin+(Rs+Rdson2-Rdson1)*K73)","v":0.79728498809978554},{"$f":"(Vin-(Rdson1+Rdcr)*K73-Vout)*M73/(Fsw*Lf)","v":1.9385883702437523},9.2892941851218769,7.3507058148781237,{"$f":"IF(MIN(Vin, -P73/(Coss_Q1+Coss_Q2)*0.00000002)<0, 0, MIN(Vin, -P73/(Coss_Q1+Coss_Q2)*0.00000002))","v":0},8.3387994982753391,{"$f":"R73^2*Rdcr","v":0.36158500077667266},{"$f":"Core_Loss_Ch1","v":0.2},{"$f":"(T73+S73*(1+Ltc*(Ta-25)))/(1-S73*Ltc*ThetaCa)","v":0.58576088890992117},0.55962225870405413,2.0763639902574911E-2,2.0763639902574911E-2,3.3523803060298096,1.4947143442621174,1.4947143442621174,7.4457821441880565,{"$f":"Rdson1*AB73^2","v":0.66527606086451629},{"$f":"(Vin*K73/2)*Fsw*(Tr_buck+Tf_buck)","v":0.34591152579622103},{"$f":"(0.5*Coss_Q1*(Vin-Q73)^2-0.5*Coss_Q2*(Vin-Q73)^2+(Qoss_Q2*(Vin-Q73)/Vin)*Vin)*Fsw","v":0.27539999999999992},{"$f":"IF(K73>N73/2,0,ABS(K73-N73/2)*Vsd_Q1*Deadtime*Fsw)","v":0},{"$f":"(AF73+AE73+AD73+AC73*(1+RdsonTopTc*Ta-RdsonTopTc*25))/(1-AC73*RdsonTopTc*ThetaJA_Q1)","v":1.4634585721724178},{"$f":"SQRT((1-M73))*SQRT(K73^2+(N73^2)/12)","v":3.7544514024990865},{"$f":"Rdson2*AH73^2","v":5.7793211868282159E-2},{"$f":"IF(K73<N73/2,Deadtime*Fsw*IF(VfdSky_Q2>0,0,Vsd_Q2)*(K73+N73/2),2*Deadtime*Fsw*IF(VfdSky_Q2>0,0,Vsd_Q2)*K73)","v":6.9305599999999995E-2},{"$f":"(AJ73+AI73*(1+RdsonBotTc*Ta-RdsonBotTc*25))/(1-AI73*RdsonBotTc*ThetaJA_Q2)","v":0.12947285184438304},{"$f":"2*Deadtime*Fsw*IF(VfdSky_Q2>0,VfdSky_Q2,Vsd_Q2)*K73","v":6.9305599999999995E-2},{"$f":"IF(QrrSky_Q2>0,QrrSky_Q2,Qrr_Q2*K73/(Iout/Number_of_Phases))*Fsw*Vin","v":0.38515199999999999},{"$f":"Rs*R73^2","v":0.20860673121731116},{"$f":"Iq*Vin","v":5.2800000000000003E-5},{"$f":"IF(Ext_VCC=1,  (Qg_Q1+Qg_Q2)*Fsw*VCC, (Qg_Q1+Qg_Q2)*Fsw*Vin)","v":7.0124999999999993E-2},{"$f":"(Vin-VCC)*Fsw*(Qg_Q1+Qg_Q2)+(RdsonDRT+RdsonDRT2)*Fsw*Qg_Q1*VCC/(RdsonDRT+2*Rgate1+RdsonDRT2)+(RdsonDRB+RdsonDRB2)*Fsw*Qg_Q2*VCC/(RdsonDRB+2*Rgate2+RdsonDRB2)","v":0.2934461538461538},{"$f":"(Qg_Q1+Qg_Q2)*Fsw*(Vin-VCC)","v":0.26647499999999996},7.0177799999999999E-2,{"$f":" SUM(U73,X73,AA73,AG73,AK73,AL73,AM73,AS73,AN73)","v":4.4274124283087248},{"$f":"Vout*K73","v":158.08000000000001},0.97275562780705838,{"$f":"ThetaJA_Q1*BC73","v":72.141673471241546},{"$f":"ThetaJA_Q2*BD73","v":10.442521582066393},null,97.27556278070584,{"$f":"U73","v":0.58576088890992117},1.9780834240168008,1.7176588921724179,0.25657301184438308,0.20860673121731116]
["Part Power","Value","Units",null,null,null,65,24,1,{"$f":"Iout*G74/100","v":8.4499999999999993},8.4499999999999993,7.4328703703703694,0.79737292608352039,1.9379096116849173,{"$f":"K74+N74/2","v":9.418954805842457},{"$f":"K74-N74/2","v":7.4810451941575407},0,{"$f":"SQRT(K74^2+(N74^2)/12)","v":8.4684979663016424},0.37292038058732629,0.2,0.59822604288630576,{"$f":"N74/SQRT(12)","v":0.55942631798572506},{"$f":"RCoutEsr*V74^2","v":2.0749102488410845E-2},{"$f":"W74","v":2.0749102488410845E-2},{"$f":"SQRT(M74*(1-M74))*SQRT(K74^2+(N74^2)/12)","v":3.4039711204016911},{"$f":"RCinEsr*Y74^2","v":1.5410735786743233},{"$f":"Z74","v":1.5410735786743233},{"$f":"SQRT(M74)*SQRT(K74^2+(N74^2)/12)","v":7.5620079632062973},0.68620757322714554,0.351316393386787,0.27539999999999992,0,1.499516711664217,3.8120195919826525,5.9579122815604305E-2,7.0388499999999979E-2,0.13244384182500954,7.0388499999999979E-2,0.39116999999999991,0.21514637341576517,5.2800000000000003E-5,7.0124999999999993E-2,0.2934461538461538,0.26647499999999996,7.0177799999999999E-2,4.5388919509540315,160.54999999999998,{"$f":"AU74/(AU74+AT74)","v":0.97250637582386534},73.822934289897105,10.644268632277889,null,{"$f":"AV74*100","v":97.250637582386531},0.59822604288630576,{"$f":"AG74+AK74+AM74","v":2.0231305534892265},{"$f":"AG74+AM74*0.66","v":1.7576889116642169},{"$f":"AK74+AM74*0.33","v":0.26152994182500955},{"$f":"AN74","v":0.21514637341576517}]
["Power Dis",{"$f":"AS9","v":7.0177799999999999E-2},"W",null,null,null,66,24,1,8.58,8.58,7.5472222222222225,0.79746086874348798,1.9372306676103881,9.5486153338051949,7.6113846661948061,0,8.5982055427258093,0.38443152048579632,0.2,0.61090834480518574,0.55923032371362802,2.0734566193904298E-2,2.0734566193904298E-2,3.4555484377528418,1.5881283957522621,1.5881283957522621,7.6782546882411209,0.70746714068996108,0.35672126097735296,0.27539999999999992,0,1.5363384517029071,3.8695663190419767,6.1391528339602694E-2,7.147139999999999E-2,0.13544446413114145,7.147139999999999E-2,0.39718800000000004,0.2217874156648825,5.2800000000000003E-5,7.0124999999999993E-2,0.2934461538461538,0.26647499999999996,{"$f":"SUM(AO75:AP75)","v":7.0177799999999999E-2},4.6521788382502836,163.02000000000001,0.97225431869208223,75.5362663315221,10.847221718137458,null,97.225431869208222,0.61090834480518574,2.0689709158340484,1.7984825317029072,0.26651650413114147,0.2217874156648825]
["Temp rise",{"$f":"B75*B62","v":2.105334},"°C",null,null,null,67,24,1,8.7100000000000009,8.7100000000000009,7.6615740740740739,0.79754881608006178,1.9365515380053677,9.6782757690026848,7.7417242309973169,0,8.7279218214654399,0.39611842047238555,0.2,0.62380896668666808,0.55903427588349142,2.0720031022914028E-2,2.0720031022914028E-2,3.5071120800298372,1.6358780738715313,1.6358780738715313,7.7945219579480103,0.72905487063520413,0.36212612856791893,0.27539999999999992,0,1.5739402111573488,3.9270913878695146,6.3230391751583528E-2,7.2554300000000002E-2,0.13847474584985903,7.2554300000000002E-2,0.40320599999999995,0.22852985796483782,5.2800000000000003E-5,7.0124999999999993E-2,0.2934461538461538,0.26647499999999996,7.0177799999999999E-2,4.7672899865531591,165.49,0.9719994956637118,77.282359188608652,11.051381942089261,null,97.199949566371174,0.62380896668666808,2.1156209570072075,1.8400561711573489,0.27153272584985899,0.22852985796483782]
["Current (switching)",{"$f":"(Qg_Q1+Qg_Q2)*Fsw+Iq","v":1.40272E-2},"A",null,null,null,68,24,1,8.84,8.84,7.7759259259259261,0.79763676809361428,1.9358722228550551,9.8079361114275265,7.8720638885724723,0,8.8576464201992433,0.40798108054739601,0.2,0.63692910408776893,0.55883817449104267,2.0705496979300294E-2,2.0705496979300294E-2,3.558661878819251,1.6843218909122613,1.6843218909122613,7.9108094321237434,0.75097087045653588,0.36753099615848484,0.27539999999999992,0,1.6123389777655563,3.9845946134946386,6.5095676358950999E-2,7.3637199999999986E-2,0.14153471479859031,7.3637199999999986E-2,0.40922400000000003,0.2353737003158054,5.2800000000000003E-5,7.0124999999999993E-2,0.2934461538461538,0.26647499999999996,7.0177799999999999E-2,4.8842428848592823,167.96,0.97174194058570451,79.061926346153371,11.256750436302628,null,97.17419405857045,0.63692910408776893,2.163097692564147,1.8824268177655563,0.27657863479859035,0.2353737003158054]
["Qrr Current",{"$f":"Qrr_Q2*Fsw","v":2.5075E-2},"A",null,null,null,69,24,1,8.9700000000000006,8.9700000000000006,7.8902777777777775,0.79772472478451883,1.9351927221446503,9.937596361072325,8.0024036389276763,0,8.987378978655947,0.42001950071113142,0.2,0.65026997639022299,0.55864201953200932,2.0690964066924965E-2,2.0690964066924965E-2,3.6101976746526834,1.7334591242589965,1.7334591242589965,8.0271167901839782,0.77321524755904247,0.37293586374905086,0.27539999999999992,0,1.6515523309199884,4.0420758210025314,6.6987345465206474E-2,7.4720099999999998E-2,0.14462439952562439,7.4720099999999998E-2,0.415242,0.24231894271796045,5.2800000000000003E-5,7.0124999999999993E-2,0.2934461538461538,0.26647499999999996,7.0177799999999999E-2,5.0030556378797177,170.43,0.97148168217392972,80.875706138639515,11.463328362692915,null,97.148168217392978,0.65026997639022299,2.211418730445613,1.9256120509199883,0.2816542595256244,0.24231894271796045]
["Diode Current",{"$f":"Deadtime*Fsw*(Iripple_Vinnom/2)*(Vsd_Q2)/Vin","v":1.7263307202627879E-4},null,null,null,null,70,24,1,9.1,9.1,8.0046296296296298,0.79781268615314871,1.9345130358593503,10.067256517929675,8.1327434820703246,0,9.1171191570487764,0.43223368096389408,0.2,0.66383282709517311,0.5584458110021181,2.0676432289651426E-2,2.0676432289651426E-2,3.6617193163709265,1.7832890508005674,1.7832890508005674,8.1434437297703504,0.79578810935923239,0.37834073133961671,0.27539999999999992,0,1.6915984656017089,4.0995348448195603,6.8905362369947917E-2,7.5802999999999982E-2,0.14774382931066934,7.5802999999999982E-2,0.42125999999999997,0.24936558517147736,5.2800000000000003E-5,7.0124999999999993E-2,0.2934461538461538,0.26647499999999996,7.0177799999999999E-2,5.1237469902692476,172.9,0.97121874425803822,82.724462755271773,11.671116912944242,null,97.121874425803824,0.66383282709517311,2.2606022949123785,1.9696300656017089,0.28675962931066934,0.24936558517147736]
["Total",{"$f":"SUM(B77:B79)","v":3.9274833072026283E-2},"A",null,null,null,71,24,1,9.23,9.23,8.118981481481482,0.79790065219987683,1.9338331639843507,10.196916581992175,8.2630834180078256,0,9.2468666346413713,0.44462362130598793,0.2,0.6776189241248981,0.55824954889709533,2.0661901651344631E-2,2.0661901651344631E-2,3.7132266605415092,1.833810946929981,1.833810946929981,8.259789965474523,0.81868956328504339,0.38374559893018273,0.27539999999999992,0,1.7324962175303806,4.1569715280586435,7.0849690368869872E-2,7.6885899999999993E-2,0.15089303416545641,7.6885899999999993E-2,0.42727800000000005,0.25651362767653152,5.2800000000000003E-5,7.0124999999999993E-2,0.2934461538461538,0.26647499999999996,7.0177799999999999E-2,5.2463363520785915,175.37,0.97095314599975147,84.608987296275998,11.880117308534077,null,97.09531459997514,0.6776189241248981,2.3106672516958371,2.0144996975303808,0.29189477416545639,0.25651362767653152]
[null,null,null,null,null,null,72,24,1,9.36,9.36,8.2333333333333325,0.79798862292507644,1.9331531065048451,10.326576553252423,8.3934234467475761,0,9.3766211084323494,0.45718932173771532,0.2,0.69162956013169896,0.55805323321266687,2.0647372155871067E-2,2.0647372155871067E-2,3.7647195709244219,1.8850240885442813,1.8850240885442813,8.3761552276677858,0.84191971677583644,0.38915046652074864,0.27539999999999992,0,1.7742650896014884,4.2143857219187622,7.2820292753762172E-2,7.7968799999999991E-2,0.15407204483438716,7.7968799999999991E-2,0.4332959999999999,0.26376307023329731,5.2800000000000003E-5,7.0124999999999993E-2,0.2934461538461538,0.26647499999999996,7.0177799999999999E-2,5.3708438255010229,177.83999999999997,0.97068490208681923,86.530098883262511,12.090330800759558,null,97.068490208681922,0.69162956013169896,2.3616331344358752,2.0602404496014883,0.29705972483438714,0.26376307023329731]
[null,null,null,null,null,null,73,24,1,9.49,9.49,8.3476851851851848,0.79807659832912092,1.9324728634060266,10.456236431703013,8.523763568296987,0,9.5063822919473449,0.46993078225938023,0.2,0.70586605281410986,0.55785686394455825,2.0632843807098806E-2,2.0632843807098806E-2,3.8161979179815027,1.9369277510444454,1.9369277510444454,8.4925392614262982,0.86547867728240557,0.3945553341113146,0.27539999999999992,0,1.816925279687186,4.2717772851335472,7.481713281251004E-2,7.9051699999999989E-2,0.1572808927952275,7.9051699999999989E-2,0.43931400000000004,0.27111391284195013,5.2800000000000003E-5,7.0124999999999993E-2,0.2934461538461538,0.26647499999999996,7.0177799999999999E-2,5.4972902329900171,180.31,0.97041402290460843,88.488645826861799,12.301758670765761,null,97.041402290460837,0.70586605281410986,2.4135201724824134,2.1068725196871858,0.30225451279522753,0.27111391284195013]
[null,null,null,null,null,null,74,24,1,9.6199999999999992,9.6199999999999992,8.4620370370370352,0.79816457841238342,1.9317924346730864,10.585896217336542,8.6541037826634568,0,9.6361499141283087,0.48284800287128604,0.2,0.72032974524056703,0.55766044108849455,2.0618316608897447E-2,2.0618316608897447E-2,3.8676615784253214,1.9895212093352508,1.9895212093352508,8.608941825542848,0.88936655226697225,0.39996020170188057,0.27539999999999992,0,1.8604977098822768,4.3291460834642645,7.6840173829093306E-2,8.0134599999999986E-2,0.16051961025984532,8.0134599999999986E-2,0.44533199999999995,0.27856615550266506,5.2800000000000003E-5,7.0124999999999993E-2,0.2934461538461538,0.26647499999999996,7.0177799999999999E-2,5.6256971468295021,182.77999999999997,0.97014051468706253,90.485506855055633,12.514402229575703,null,97.014051468706256,0.72032974524056703,2.4663493201421223,2.154416829882277,0.30747917025984528,0.27856615550266506]
[null,null,null,null,null,null,75,24,1,9.75,9.75,8.5763888888888875,0.79825256317523741,1.9311118202912139,10.715555910145607,8.784444089854393,0,9.7659237183111536,0.49594098357373623,0.2,0.73502200618069879,0.55746396464020032,2.0603790565138162E-2,2.0603790565138162E-2,3.9191104348039421,2.0428037378251562,2.0428037378251562,8.7253626916172369,0.9135834492031919,0.40536506929244653,0.27539999999999992,0,1.9050040572826221,4.3864919892331207,7.8889379083585981E-2,8.1217499999999984E-2,0.16378823017499361,8.1217499999999984E-2,0.45135000000000003,0.28611979821561706,5.2800000000000003E-5,7.0124999999999993E-2,0.2934461538461538,0.26647499999999996,7.0177799999999999E-2,5.7560869202442264,185.25,0.96986437964855166,92.521592405870123,12.728262818122241,null,96.98643796485517,0.73502200618069879,2.5201422874576158,2.202895057282622,0.31273373017499362,0.28611979821561706]
[null,null,null,null,null,null,76,24,1,9.8800000000000008,9.8800000000000008,8.6907407407407415,0.79834055261805603,1.9304310202455961,10.845215510122799,8.9147844898772028,0,9.8957034612836168,0.50920972436703482,0.2,0.74994423044439473,0.5572674345953994,2.0589265679693651E-2,2.0589265679693651E-2,3.970544375118271,2.0967746104261842,2.0967746104261842,8.841801643218016,0.93812947557615378,0.4107699368830125,0.27539999999999992,0,1.9504667863892979,4.4438148808931883,8.096471185215573E-2,8.2300399999999996E-2,0.16708678622313872,8.2300399999999996E-2,0.45736800000000011,0.29377484098098167,5.2800000000000003E-5,7.0124999999999993E-2,0.2934461538461538,0.26647499999999996,7.0177799999999999E-2,5.8884827201436902,187.72000000000003,0.96958561609795091,94.597845988350514,12.943341807281749,null,96.958561609795098,0.74994423044439473,2.5749215726124368,2.252329666389298,0.3180182262231388,0.29377484098098167]
[null,null,null,null,null,null,77,24,1,10.01,10.01,8.805092592592592,0.79842854674121289,1.92975003452142,10.974875017260709,9.0451249827392903,0,10.02548891241609,0.52265422525148542,0.2,0.76509783922881269,0.55707085094981579,2.0574741956438207E-2,2.0574741956438207E-2,4.0219632924690334,2.1514331005537906,2.1514331005537906,8.9582584751091563,0.96300473888238036,0.41617480447357841,0.27539999999999992,0,1.996909183238434,4.5011146426316397,8.3066135407063105E-2,8.3383299999999994E-2,0.17041531282333275,8.3383299999999994E-2,0.46338599999999996,0.3015312837989339,5.2800000000000003E-5,7.0124999999999993E-2,0.2934461538461538,0.26647499999999996,7.0177799999999999E-2,6.022908561599742,190.19,0.96930421853611692,96.715245616014229,13.159640597909645,null,96.930421853611691,0.76509783922881269,2.6307104960617664,2.302743943238434,0.32333269282333277,0.3015312837989339]
[null,null,null,null,null,null,78,24,1,10.14,10.14,8.9194444444444443,0.79851654554508134,1.9290688631038699,11.104534431551935,9.1754655684480664,0,10.155279852858959,0.53627448622739193,0.2,0.78048428047349838,0.55687421369917234,2.0560219399247636E-2,2.0560219399247636E-2,4.0733670847307701,2.2067784811267512,2.2067784811267512,9.0747329925358855,0.98820934662983173,0.42157967206414437,0.27539999999999992,0,2.0443553913638124,4.5583911640033463,8.5193613016661493E-2,8.4466199999999991E-2,0.17377384513213226,8.4466199999999991E-2,0.46940399999999999,0.30938912666964924,5.2800000000000003E-5,7.0124999999999993E-2,0.2934461538461538,0.26647499999999996,7.0177799999999999E-2,6.1593893441650902,192.66000000000003,0.96902017773778137,98.874805317280121,13.377160620877785,null,96.902017773778141,0.78048428047349838,2.6875332364959448,2.3541620313638125,0.3286771651321323,0.30938912666964924]
[null,null,null,null,null,null,79,24,1,10.27,10.27,9.0337962962962948,0.79860454903003497,1.9283875059781295,11.234193752989064,9.3058062470109348,0,10.285076074800536,0.5500705072950588,0.2,0.79610502922378179,0.55667752283919214,2.0545698011999344E-2,2.0545698011999344E-2,4.1247556542504364,2.2628100245670359,2.2628100245670359,9.1912250105644553,1.0137434063379069,0.42698453965471034,0.27539999999999992,0,2.0928304497069417,4.6156443395921238,8.734710794539613E-2,8.5549099999999989E-2,0.1771624190445609,8.5549099999999989E-2,0.47542200000000001,0.3173483695933032,5.2800000000000003E-5,7.0124999999999993E-2,0.2934461538461538,0.26647499999999996,7.0177799999999999E-2,6.2979508901476224,195.13,0.96873348081874533,101.07757672769155,13.595903337113629,null,96.873348081874539,0.79610502922378179,2.7454148687515025,2.4066089697069417,0.3340516790445609,0.3173483695933032]
[null,null,null,null,null,null,80,24,1,10.4,10.4,9.148148148148147,0.79869255719644705,1.9277059631293791,11.36385298156469,9.4361470184353102,0,10.414877380780361,0.56404228845478999,0.2,0.81196158800263718,0.55648077836559695,2.0531177798572234E-2,2.0531177798572234E-2,4.1761289075684953,2.3195270027996884,2.3195270027996884,9.3077343534711492,1.0396070255374439,0.43238940724527636,0.27539999999999992,0,2.1423603325976854,4.6728740686972738,8.9526583453803987E-2,8.6631999999999987E-2,0.18058107119511788,8.6631999999999987E-2,0.48144000000000003,0.32540901257007115,5.2800000000000003E-5,7.0124999999999993E-2,0.2934461538461538,0.26647499999999996,7.0177799999999999E-2,6.4386199849637711,197.6,0.9684441112891361,103.32465076910279,13.815870237641299,null,96.844411128913606,0.81196158800263718,2.8043814037928034,2.4601107325976854,0.3394562711951179,0.32540901257007115]
[null,null,null,null,null,null,81,24,1,10.53,10.53,9.2624999999999993,0.7987805700446915,1.9270242345428004,11.493512117271399,9.5664878827286,0,10.544683583053102,0.57818982970688992,0.2,0.82805548719118172,0.55628398027410919,2.0516658762846845E-2,2.0516658762846845E-2,4.2274867551605517,2.3769286872526996,2.3769286872526996,9.4242608541763175,1.0658003117707215,0.43779427483584216,0.27539999999999992,0,2.1929719919375019,4.7300802550431928,9.1732002798512846E-2,8.7714899999999985E-2,0.18402983895883077,8.7714899999999985E-2,0.48745799999999989,0.33357105560012884,5.2800000000000003E-5,7.0124999999999993E-2,0.2934461538461538,0.26647499999999996,7.0177799999999999E-2,6.5814244197031897,200.07,0.96815204909337327,105.61715942137508,14.03706284362441,null,96.815204909337325,0.82805548719118172,2.8644598308963323,2.5146942719375018,0.3448909789588307,0.33357105560012884]
[null,null,null,null,null,null,82,24,1,10.66,10.66,9.3768518518518515,0.79886858757514168,1.9263423202035703,11.623171160101785,9.696828839898215,0,10.674494502998753,0.59251313105166314,0.2,0.84438828541800581,0.55608712856044984,2.0502140908705193E-2,2.0502140908705193E-2,4.2788291111978047,2.4350143488568947,2.4350143488568947,9.540804353719615,1.0923233725914618,0.44319914242640818,0.27539999999999992,0,2.2446934017271016,4.7872628065101486,9.3963329232241224E-2,8.8797799999999982E-2,0.18750876045235473,8.8797799999999982E-2,0.49347600000000003,0.34183449868365179,5.2800000000000003E-5,7.0124999999999993E-2,0.2934461538461538,0.26647499999999996,7.0177799999999999E-2,6.7263930360467139,202.54,0.96785727063739246,107.95627759253826,14.259482706410839,null,96.785727063739245,0.84438828541800581,2.9256781621794561,2.5703875617271015,0.35035584045235474,0.34183449868365179]
[null,null,null,null,null,null,83,24,1,10.79,10.79,9.491203703703702,0.79895660978817129,1.925660220096866,11.752830110048432,9.8271698899515663,0,10.804309970575257,0.60701219248941396,0.2,0.86096156995752593,0.55589022322033987,2.0487624240030901E-2,2.0487624240030901E-2,4.330155893324716,2.4937832580458044,2.4937832580458044,9.6573647007729804,1.119176315564832,0.44860401001697409,0.27539999999999992,0,2.2975536050909025,4.84442163488439,9.6220526003797366E-2,8.988069999999998E-2,0.19101787453511562,8.988069999999998E-2,0.49949399999999994,0.35019934182081575,5.2800000000000003E-5,7.0124999999999993E-2,0.2934461538461538,0.26647499999999996,7.0177799999999999E-2,6.873555773690196,205.01,0.9675597488035752,110.34322509381791,14.483131407579208,null,96.755974880357513,0.86096156995752593,2.9880654796260178,2.6272196450909027,0.35585089453511565,0.35019934182081575]
[null,null,null,null,null,null,84,24,1,10.92,10.92,9.6055555555555543,0.79904463668415393,1.9249779342078626,11.882488967103932,9.9575110328960683,0,10.934129823810043,0.62168701402044757,0.2,0.87777695713756099,0.55569326424949961,2.0473108760709118E-2,2.0473108760709118E-2,4.3814670224524885,2.553234684755544,2.553234684755544,9.7739417511882181,1.1463592482674425,0.45400887760754011,0.27539999999999992,0,2.3515827639620857,4.9015566556260497,9.8503556358079281E-2,9.0963599999999992E-2,0.19455722081049934,9.0963599999999992E-2,0.50551200000000007,0.35866558501179674,5.2800000000000003E-5,7.0124999999999993E-2,0.2934461538461538,0.26647499999999996,7.0177799999999999E-2,7.0229437204381959,207.48,0.9672594529537496,112.77926872640761,14.708010558987326,null,96.725945295374956,0.87777695713756099,3.0516519847725849,2.6852206839620858,0.36137618081049938,0.35866558501179674]
[null,null,null,null,null,null,85,24,1,11.05,11.05,9.7199074074074083,0.79913266826346352,1.9242954625217343,12.012147731260868,10.087852268739134,0,11.063953908327266,0.63653759564506884,0.2,0.89483609275633391,0.55549625164364935,2.0458594474626585E-2,2.0458594474626585E-2,4.4327624225670483,2.6133678984246909,2.6133678984246909,9.8905353675763941,1.1738722782873543,0.45941374519810613,0.27539999999999992,0,2.4068122116045445,4.9586677876533178,0.10081238353607365,9.2046499999999989E-2,0.19812683962708605,9.2046499999999989E-2,0.51153000000000004,0.36723322825677052,5.2800000000000003E-5,7.0124999999999993E-2,0.2934461538461538,0.26647499999999996,7.0177799999999999E-2,7.1745891651440523,209.95000000000002,0.96695634892054028,115.26572448739087,14.934121802822402,null,96.695634892054031,0.89483609275633391,3.1164690512316304,2.7444220116045446,0.36693173962708603,0.36723322825677052]
[null,null,null,null,null,null,86,24,1,11.18,11.18,9.8342592592592588,0.79922070452647365,1.9236128050236527,12.141806402511826,10.218193597488174,0,11.193782076907887,0.65156393736358209,0.2,0.91214065250911158,0.55529918539850853,2.0444081385671588E-2,2.0444081385671588E-2,4.4840420205503637,2.6741821679941644,2.6741821679941644,10.007145418916398,1.2017155132240733,0.46481861278867198,0.27539999999999992,0,2.4632745081614438,5.015754953141629,0.10314697077485561,9.3129399999999987E-2,0.20172677207993009,9.3129399999999987E-2,0.5175479999999999,0.37590227155591277,5.2800000000000003E-5,7.0124999999999993E-2,0.2934461538461538,0.26647499999999996,7.0177799999999999E-2,7.328525653686234,212.42,0.96665039898726945,117.80395990278063,15.161466811653154,null,96.665039898726945,0.91214065250911158,3.182549280241374,2.8048561881614438,0.37251761207993006,0.37590227155591277]
[null,null,null,null,null,null,87,24,1,11.31,11.31,9.9486111111111111,0.79930874547355824,1.9229299616987885,12.271464980849395,10.348535019150606,0,11.323614189079972,0.66676603917629296,0.2,0.92969234242470278,0.55510206550979613,2.0429569497733942E-2,2.0429569497733942E-2,4.5353057460140276,2.7356767619071052,2.7356767619071052,10.123771780190426,1.2298890606885602,0.47022348037923795,0.27539999999999992,0,2.5210034994348742,5.072818077336624,0.10550728130758828,9.4212299999999985E-2,0.20535706001188542,9.4212299999999985E-2,0.52356599999999998,0.3846727149093998,5.2800000000000003E-5,7.0124999999999993E-2,0.2934461538461538,0.26647499999999996,7.0177799999999999E-2,7.4847880481857008,214.89000000000001,0.96634156185653641,120.39539649626471,15.390047288483739,null,96.634156185653637,0.92969234242470278,3.2499265594467595,2.8665570594348742,0.37813384001188544,0.3846727149093998]
[null,null,null,null,null,null,88,24,1,11.44,11.44,10.062962962962962,0.79939679110509121,1.9222469325323106,12.401123466266155,10.478876533733844,0,11.453450110736755,0.68214390108350609,0.2,0.9474928993120264,0.55490489197323101,2.0415058814705074E-2,2.0415058814705074E-2,4.5865535311441317,2.7978509481087439,2.7978509481087439,10.240414332044153,1.2583930283032239,0.47562834796980391,0.27539999999999992,0,2.5800343791169431,5.1298570883798016,0.10789327836352201,9.5295199999999983E-2,0.20901774601497639,9.5295199999999983E-2,0.52958399999999994,0.39354455831740742,5.2800000000000003E-5,7.0124999999999993E-2,0.2934461538461538,0.26647499999999996,7.0177799999999999E-2,7.643412589684802,217.35999999999999,0.9660297926075313,123.04151240291161,15.619864966809541,null,96.602979260753131,0.9474928993120264,3.3186361251319192,2.929559819116943,0.3837804660149764,0.39354455831740742]
[null,null,null,null,null,null,89,24,1,11.57,11.57,10.177314814814816,0.79948484142144605,1.9215637175093856,12.530781858754693,10.609218141245307,0,11.583289713780395,0.69769752308552757,0.2,0.96554409121699525,0.55470766478453093,2.040054934047791E-2,2.040054934047791E-2,4.6377853105565681,2.8607039940462995,2.8607039940462995,10.357072960469768,1.2872275237019282,0.48103321556036988,0.27539999999999992,0,2.6404037547101349,5.1868719171458935,0.11030492516799452,9.6378099999999994E-2,0.21270887343181488,9.6378099999999994E-2,0.53560200000000002,0.40251780178011209,5.2800000000000003E-5,7.0124999999999993E-2,0.2934461538461538,0.26647499999999996,7.0177799999999999E-2,7.8044369645258342,219.83,0.9657150426420672,125.74384513782567,15.850921610674867,null,96.571504264206723,0.96554409121699525,3.3887146281419498,2.9939010747101351,0.38945753343181488,0.40251780178011209]
[null,null,null,null,null,null,90,24,1,11.7,11.7,10.291666666666666,0.799572896422997,1.92088031661518,12.660440158307589,10.73955984169241,0,11.713132875789322,0.7134269051826625,0.2,0.98384771788993519,0.55451038393941388,2.0386041078946978E-2,2.0386041078946978E-2,4.6890010211619035,2.9242351666688311,2.9242351666688311,10.473747556510004,1.3163926545299913,0.48643808315093578,0.27539999999999992,0,2.7021497173936266,5.2438624970909888,0.11274218494242909,9.7460999999999978E-2,0.21643048635706144,9.7460999999999978E-2,0.54161999999999999,0.4115924452976899,5.2800000000000003E-5,7.0124999999999993E-2,0.2934461538461538,0.26647499999999996,7.0177799999999999E-2,7.9679003746860912,222.29999999999998,0.96539725961924816,128.50399453053234,16.0832190147324,null,96.539725961924816,0.98384771788993519,3.4602002037506883,3.0596189173936268,0.39516508635706143,0.4115924452976899]
[null,null,null,null,null,null,91,24,1,11.83,11.83,10.406018518518518,0.79966095611011823,1.9201967298348586,12.79009836491743,10.86990163508257,0,11.842979479707477,0.7293320473752164,0.2,1.0024056112637951,0.55431304943359738,2.037153403400838E-2,2.037153403400838E-2,4.7402006020391596,2.9884437324271311,2.9884437324271311,10.59043801598164,1.3458885284441897,0.49184295074150175,0.27539999999999992,0,2.765311916112934,5.3008287641106868,0.11520502090433524,9.854389999999999E-2,0.22018262963893484,9.854389999999999E-2,0.54763799999999996,0.42076848887031715,5.2800000000000003E-5,7.0124999999999993E-2,0.2934461538461538,0.26647499999999996,7.0177799999999999E-2,8.1338436123471194,224.77,0.96507638737862422,131.32362583674325,16.316759004304647,null,96.507638737862422,1.0024056112637951,3.5331325457518687,3.1267529961129341,0.4009031696389348,0.42076848887031715]
[null,null,null,null,null,null,92,24,1,11.96,11.96,10.520370370370371,0.79974902048318308,1.9195129571535821,12.919756478576792,11.00024352142321,0,11.972829413553704,0.74541294966349503,0.2,1.0212196359433925,0.55411566126279765,2.0357028209559709E-2,2.0357028209559709E-2,4.7913839943177763,3.053328957273608,3.053328957273608,10.707144239216927,1.3757152531127546,0.49724781833206777,0.27539999999999992,0,2.8299316361927671,5.3577706564074301,0.11769339626730806,9.9626799999999988E-2,0.22396534888076608,9.9626799999999988E-2,0.55365599999999993,0.43004593249817025,5.2800000000000003E-5,7.0124999999999993E-2,0.2934461538461538,0.26647499999999996,7.0177799999999999E-2,8.3023091389982646,227.24,0.96475236585161062,134.20447304009622,16.551543435447179,null,96.475236585161056,1.0212196359433925,3.6075529850735331,3.1953445961927671,0.40667182888076603,0.43004593249817025]
[null,null,null,null,null,null,93,24,1,12.09,12.09,10.634722222222221,0.79983708954256638,1.9188289985565135,13.049414499278257,11.130585500721743,0,12.102682570149829,0.76166961204780415,0.2,1.0402916897059511,0.55391821942273156,2.0342523609500191E-2,2.0342523609500191E-2,4.842551141067144,3.1188901066621431,3.1188901066621431,10.823866130821663,1.4058729362153799,0.50265268592263357,0.27539999999999992,0,2.8960518827976593,5.4146881143663439,0.1202072742410266,0.10070969999999999,0.22777869044259758,0.10070969999999999,0.559674,0.4394247761814255,5.2800000000000003E-5,7.0124999999999993E-2,0.2934461538461538,0.26647499999999996,7.0177799999999999E-2,8.4733411693992782,229.71,0.964425130960889,137.14834235750169,16.787574195013722,null,96.442513096088902,1.0402916897059511,3.6835045732402572,3.2654367227976593,0.4124711104425976,0.4394247761814255]
[null,null,null,null,null,null,94,24,1,12.22,12.22,10.749074074074073,0.79992516328864161,1.9181448540288093,13.179072427014406,11.260927572985596,0,12.232538846866028,0.7781020345284495,0.2,1.0596237040131977,0.55372072390911431,2.0328020237730546E-2,2.0328020237730546E-2,4.893701987193193,3.1851264455479948,3.1851264455479948,10.940603599448622,1.4363616854432175,0.5080575535131997,0.27539999999999992,0,2.963717469591729,5.4715810804390284,0.12274661803125513,0.1017926,0.23162270144283134,0.1017926,0.56569200000000008,0.44890501992025938,5.2800000000000003E-5,7.0124999999999993E-2,0.2934461538461538,0.26647499999999996,7.0177799999999999E-2,8.6469857607537417,232.18,0.96409461450742906,140.15711596285263,17.024853200723239,null,96.40946145074291,1.0596237040131977,3.76103217103456,3.3370741895917293,0.41830106144283141,0.44890501992025938]
[null,null,null,null,null,null,95,24,1,12.35,12.35,10.863425925925926,0.80001324172178301,1.9174605235556308,13.308730261777814,11.391269738222185,0,12.36239814538221,0.79471021710573742,0.2,1.079217644535291,0.5535231747176621,2.0313518098153141E-2,2.0313518098153141E-2,4.9448364793414541,3.2520372383876563,3.2520372383876563,11.057356557585255,1.4671816084988836,0.5134624211037655,0.27539999999999992,0,3.032975112978503,5.5284494990345943,0.125311390839841,0.10287549999999998,0.23549742975992033,0.10287549999999998,0.57171000000000005,0.45848666371484853,5.2800000000000003E-5,7.0124999999999993E-2,0.2934461538461538,0.26647499999999996,7.0177799999999999E-2,8.8232909074743713,234.65,0.96376074404470335,143.23275594509713,17.26338240122876,null,96.37607440447033,1.079217644535291,3.8401825427384231,3.4103037129785032,0.42416172975992039,0.45848666371484853]
[null,null,null,null,null,null,96,24,1,12.48,12.48,{"$f":"Vout*K105/(Vin*Efficiency)","v":10.977777777777778},0.80010132484236507,{"$f":"(Vin-(Rdson1+Rdcr)*K105-Vout)*M105/(Fsw*Lf)","v":1.9167760071221334},13.438388003561068,11.521611996438933,{"$f":"IF(MIN(Vin, -P105/(Coss_Q1+Coss_Q2)*0.00000002)<0, 0, MIN(Vin, -P105/(Coss_Q1+Coss_Q2)*0.00000002))","v":0},12.492260371464269,{"$f":"R105^2*Rdcr","v":0.81149415977997419},0.2,{"$f":"(T105+S105*(1+Ltc*(Ta-25)))/(1-S105*Ltc*ThetaCa)","v":1.0990755116868596},0.55332557184408993,2.0299017194671858E-2,2.0299017194671858E-2,4.9959545658061737,3.3196217491387405,3.3196217491387405,11.174124921354617,{"$f":"Rdson1*AB105^2","v":1.4983328130964599},0.51886728869433152,0.27539999999999992,0,{"$f":"(AF105+AE105+AD105+AC105*(1+RdsonTopTc*Ta-RdsonTopTc*25))/(1-AC105*RdsonTopTc*ThetaJA_Q1)","v":3.1038735323338997},5.5852933164175242,{"$f":"Rdson2*AH105^2","v":0.12790155586471488},0.10395839999999999,{"$f":"(AJ105+AI105*(1+RdsonBotTc*Ta-RdsonBotTc*25))/(1-AI105*RdsonBotTc*ThetaJA_Q2)","v":0.23940292403410815},0.10395839999999999,0.57772800000000002,0.4681697075653698,5.2800000000000003E-5,7.0124999999999993E-2,0.2934461538461538,0.26647499999999996,7.0177799999999999E-2,{"$f":" SUM(U105,X105,AA105,AG105,AK105,AL105,AM105,AS105,AN105)","v":9.0023066419536484},237.12,0.9634234427395898,146.3773085180238,17.503163776188206,null,96.342344273958986,1.0990755116868596,3.9210044563680078,3.4851740123338999,0.4300531640341082,0.4681697075653698]
[null,null,null,null,null,null,97,24,1,12.61,12.61,{"$f":"Vout*K106/(Vin*Efficiency)","v":11.092129629629628},0.8001894126507616,{"$f":"(Vin-(Rdson1+Rdcr)*K106-Vout)*M106/(Fsw*Lf)","v":1.9160913047134707},13.568045652356735,11.651954347643263,{"$f":"IF(MIN(Vin, -P106/(Coss_Q1+Coss_Q2)*0.00000002)<0, 0, MIN(Vin, -P106/(Coss_Q1+Coss_Q2)*0.00000002))","v":0},12.622125434754107,{"$f":"R106^2*Rdcr","v":0.82845386255146614},0.2,{"$f":"(T106+S106*(1+Ltc*(Ta-25)))/(1-S106*Ltc*ThetaCa)","v":1.1191993411754437},0.55312791528411176,2.0284517531192099E-2,2.0284517531192099E-2,5.047056196445026,3.38787924125986,3.38787924125986,11.290908610328527,{"$f":"Rdson1*AB106^2","v":1.5298154069614904},0.52427215628489754,0.27539999999999992,0,{"$f":"(AF106+AE106+AD106+AC106*(1+RdsonTopTc*Ta-RdsonTopTc*25))/(1-AC106*RdsonTopTc*ThetaJA_Q1)","v":3.1764635566808406},5.6421124806118232,{"$f":"Rdson2*AH106^2","v":0.13051707629989037},0.10504129999999998,{"$f":"(AJ106+AI106*(1+RdsonBotTc*Ta-RdsonBotTc*25))/(1-AI106*RdsonBotTc*ThetaJA_Q2)","v":0.24333923366921525},0.10504129999999998,0.58374599999999988,0.47795415147199971,5.2800000000000003E-5,7.0124999999999993E-2,0.2934461538461538,0.26647499999999996,7.0177799999999999E-2,{"$f":" SUM(U106,X106,AA106,AG106,AK106,AL106,AM106,AS106,AN106)","v":9.1840851417885521},239.58999999999997,0.96308262921938148,149.59290850059531,17.744199336337061,null,96.308262921938152,1.1191993411754437,4.003548790350056,3.5617359166808407,0.43597541366921522,0.47795415147199971]
[null,null,null,null,null,null,98,24,1,12.74,12.74,{"$f":"Vout*K107/(Vin*Efficiency)","v":11.206481481481481},0.80027750514734697,{"$f":"(Vin-(Rdson1+Rdcr)*K107-Vout)*M107/(Fsw*Lf)","v":1.9154064163147966},13.697703208157398,11.782296791842603,{"$f":"IF(MIN(Vin, -P107/(Coss_Q1+Coss_Q2)*0.00000002)<0, 0, MIN(Vin, -P107/(Coss_Q1+Coss_Q2)*0.00000002))","v":0},12.751993248572488,{"$f":"R107^2*Rdcr","v":0.84558932542051923},0.2,{"$f":"(T107+S107*(1+Ltc*(Ta-25)))/(1-S107*Ltc*ThetaCa)","v":1.1395912045626313},0.55293020503344215,2.0270019111620904E-2,2.0270019111620904E-2,5.0981413225990222,3.4568089777104971,3.4568089777104971,11.407707547352169,{"$f":"Rdson1*AB107^2","v":1.5616294978309877},0.52967702387546345,0.27539999999999992,0,{"$f":"(AF107+AE107+AD107+AC107*(1+RdsonTopTc*Ta-RdsonTopTc*25))/(1-AC107*RdsonTopTc*ThetaJA_Q1)","v":3.2507982382927976},5.6989069413109998,{"$f":"Rdson2*AH107^2","v":0.13315791533546303},0.10612419999999999,{"$f":"(AJ107+AI107*(1+RdsonBotTc*Ta-RdsonBotTc*25))/(1-AI107*RdsonBotTc*ThetaJA_Q2)","v":0.24730640883447053},0.10612419999999999,0.58976399999999995,0.48783999543491496,5.2800000000000003E-5,7.0124999999999993E-2,0.2934461538461538,0.26647499999999996,7.0177799999999999E-2,{"$f":" SUM(U107,X107,AA107,AG107,AK107,AL107,AM107,AS107,AN107)","v":9.3686808439469331},242.06,0.96273821740423571,152.88178408829751,17.986491123562953,null,96.273821740423571,1.1395912045626313,4.0878686471272676,3.6400424782927976,0.44192852883447054,0.48783999543491496]
[null,null,null,null,null,null,99,24,1,12.87,12.87,{"$f":"Vout*K108/(Vin*Efficiency)","v":11.320833333333331},0.80036560233249565,{"$f":"(Vin-(Rdson1+Rdcr)*K108-Vout)*M108/(Fsw*Lf)","v":1.9147213419112623},13.827360670955631,11.912639329044367,{"$f":"IF(MIN(Vin, -P108/(Coss_Q1+Coss_Q2)*0.00000002)<0, 0, MIN(Vin, -P108/(Coss_Q1+Coss_Q2)*0.00000002))","v":0},12.881863729733785,{"$f":"R108^2*Rdcr","v":0.86290054838744024},0.2,{"$f":"(T108+S108*(1+Ltc*(Ta-25)))/(1-S108*Ltc*ThetaCa)","v":1.1602532098382028},0.5527324410877944,2.0255521939866818E-2,2.0255521939866818E-2,5.1492098970172631,3.5264102209508912,3.5264102209508912,11.524521658379266,{"$f":"Rdson1*AB108^2","v":1.5937751934534334},0.53508189146602936,0.27539999999999992,0,{"$f":"(AF108+AE108+AD108+AC108*(1+RdsonTopTc*Ta-RdsonTopTc*25))/(1-AC108*RdsonTopTc*ThetaJA_Q1)","v":3.3269329737561368},5.755676649793493,{"$f":"Rdson2*AH108^2","v":0.13582403615760996},0.10720709999999999,{"$f":"(AJ108+AI108*(1+RdsonBotTc*Ta-RdsonBotTc*25))/(1-AI108*RdsonBotTc*ThetaJA_Q2)","v":0.25130450046639102},0.10720709999999999,0.59578200000000003,0.49782723945429247,5.2800000000000003E-5,7.0124999999999993E-2,0.2934461538461538,0.26647499999999996,7.0177799999999999E-2,{"$f":" SUM(U108,X108,AA108,AG108,AK108,AL108,AM108,AS108,AN108)","v":9.5561505664057798},244.52999999999997,0.96239011632431226,156.24626193775774,18.230041210982119,null,96.239011632431229,1.1602532098382028,4.1740194742225283,3.7201490937561368,0.44791256046639105,0.49782723945429247]
[null,null,null,null,null,null,100,24,1,13,13,{"$f":"Vout*K109/(Vin*Efficiency)","v":11.435185185185185},0.80045370420658168,{"$f":"(Vin-(Rdson1+Rdcr)*K109-Vout)*M109/(Fsw*Lf)","v":1.914036081488018},13.957018040744009,12.042981959255991,{"$f":"IF(MIN(Vin, -P109/(Coss_Q1+Coss_Q2)*0.00000002)<0, 0, MIN(Vin, -P109/(Coss_Q1+Coss_Q2)*0.00000002))","v":0},13.011736798371814,{"$f":"R109^2*Rdcr","v":0.88038753145253645},0.2,{"$f":"(T109+S109*(1+Ltc*(Ta-25)))/(1-S109*Ltc*ThetaCa)","v":1.1811875020075915},0.55253462344288184,2.0241026019839986E-2,2.0241026019839986E-2,5.2002618737861876,3.5966822329419132,3.5966822329419132,11.64135087231711,{"$f":"Rdson1*AB109^2","v":1.6262526015887799},0.54048675905659538,0.27539999999999992,0,{"$f":"(AF109+AE109+AD109+AC109*(1+RdsonTopTc*Ta-RdsonTopTc*25))/(1-AC109*RdsonTopTc*ThetaJA_Q1)","v":3.404925633068002},5.8124215588431687,{"$f":"Rdson2*AH109^2","v":0.13851540194858988},0.10828999999999998,{"$f":"(AJ109+AI109*(1+RdsonBotTc*Ta-RdsonBotTc*25))/(1-AI109*RdsonBotTc*ThetaJA_Q2)","v":0.25533356027070875},0.10828999999999998,0.6018,0.50791588353030959,5.2800000000000003E-5,7.0124999999999993E-2,0.2934461538461538,0.26647499999999996,7.0177799999999999E-2,{"$f":" SUM(U109,X109,AA109,AG109,AK109,AL109,AM109,AS109,AN109)","v":9.7465536378383657},247,0.96203822992075427,159.68877258885607,18.474851703017848,null,96.20382299207543,1.1811875020075915,4.2620591933387111,3.8021136330680019,0.4539275602707088,0.50791588353030959]

{"sheet":"Efficiency Plot Management","index":10,"n_rows":2,"n_cols":1,"rows_kept":2,"cut":false,"hidden":true,"merged":[]}
[]
[{"$f":"IF(PLOT_TYPE=1, \"EFF_Ch1\", \"EFF_Ch2\")","v":"EFF_Ch1"}]

{"sheet":"Input Filter Calculations","index":11,"n_rows":97,"n_cols":40,"rows_kept":97,"cut":false,"hidden":true,"merged":[[10,29,10,30],[10,31,10,34],[9,0,11,0],[9,1,10,1],[10,8,10,9],[10,11,10,14],[10,16,10,19],[11,17,11,19]]}
[]
[null,null,null,null,null,null,null,null,null,null,null,null,null,null,null,null,null,null,null,null,null,null,null,null,null,null,null,null,null,"AEF comparison Values"]
[null,null,null,{"$f":"L_infilter*0.000001","v":6.8000000000000005E-7},null,null,null,null,null,null,null,"Lfilter Passive",{"$f":"'Input Filters'!O9*0.000001","v":6.8000000000000005E-7},null,null,null,null,null,null,null,null,null,null,null,null,null,null,null,null,"Lfilter",{"$f":"'Input Filters'!G9*0.000001","v":9.9999999999999995E-7}]
[null,null,null,null,null,null,null,null,null,null,null,"Cfilter Passive",{"$f":"'Input Filters'!O10*0.000001","v":4.6999999999999995E-7},null,null,null,null,null,null,null,null,null,null,null,null,null,null,null,null,"Cinj",{"$f":"'Input Filters'!G10*0.000001","v":9.9999999999999995E-7}]
[null,null,null,null,null,null,null,null,null,null,null,"Cdamp passive",{"$f":"'Input Filters'!O11*0.000001","v":9.9999999999999995E-7},null,null,null,null,null,null,null,null,null,null,null,null,null,null,null,null,"Cdamp",{"$f":"'Input Filters'!G11*0.000001","v":9.9999999999999995E-7}]
[null,null,null,null,null,null,null,null,null,null,null,"Rdamp passive",{"$f":"'Input Filters'!O12","v":0.35},null,null,null,null,null,null,null,null,null,null,null,null,null,null,null,null,"Rdamp",{"$f":"'Input Filters'!G12","v":10}]
[]
[]
[]
["Freq (Hz)","(kHz)",null,null,null,null,null,null,null,null,null,null,null,null,null,null,null,null,null,null,null,null,"AEF",null,null,null,"Passive",null,null,"AEFCompare"]
[null,null,null,null,null,null,null,null,"AEF Numerator",null,null,"AEF Denominator",null,null,null,null,"Passive",null,null,null,null,null,"Magnitude","Phase",null,null,"Magnitude","Phase",null,"AEF Numerator",null,"AEF Denominator"]
[null,null,"jω","-ω^2","-jω^3",null,"Gop",null,null,null,null,null,null,null,null,null,"Numerator","Denominator",null,null,null,null,null,null,null,null,null,null,null,null,null,null,null,null,null,null,null,null,"Magnitude","Phase"]
[1,{"$f":"A13/1000","v":1E-3},{"$f":"COMPLEX(0,2*Pi*A13)","v":"6,2831853i"},{"$f":"COMPLEX(-POWER(2*Pi*A13,2),0)","v":"-39,4784175141361"},{"$f":"COMPLEX(0,-POWER(2*Pi*A13,3))","v":"-248,050212592082i"},null,{"$f":"IMSUM(IMPRODUCT(C13,Rcomp_AEF*Csen_AEF),Csen_AEF/Ccomp_AEF)","v":{"$error":"#VALUE!"}},null,{"$f":"IMPRODUCT((RdampSel*CdampSel+RdampSel*CinjSel),C13)","v":{"$error":"#REF!"}},{"$f":"IMSUM(1,I13)","v":{"$error":"#REF!"}},null,{"$f":"IMPRODUCT(G13,L_infilterStd*RdampSel*CinjSel*CdampSel,E13)","v":{"$error":"#VALUE!"}},{"$f":"IMPRODUCT(G13,L_infilterStd*CinjSel,D13)","v":{"$error":"#VALUE!"}},{"$f":"J13","v":{"$error":"#REF!"}},{"$f":"IMSUM(L13:N13)","v":{"$error":"#VALUE!"}},0,{"$f":"IMSUM(IMPRODUCT(C13,RdampPssv*CdampPssv),1)","v":"1+0,000002199114855i"},{"$f":"IMPRODUCT(RdampPssv*CdampPssv*CfilterPssv*LinfilterPssv,E13)","v":"-2,77468967805503E-17i"},{"$f":"IMPRODUCT(D13,LinfilterPssv*(CfilterPssv+CdampPssv))","v":"-3,94626261471304E-11"},{"$f":"IMSUM(S13,R13,Q13)","v":"0,999999999960537+2,19911485497225E-06i"},1,{"$f":"CHOOSE(INFILTER_TYPE,U13,IMDIV(J13,O13))","v":1},{"$f":"20*LOG10(IMABS(V13))","v":0},{"$f":"IMARGUMENT(V13)*180/Pi","v":0},null,{"$f":"IMDIV(Q13,T13)","v":"1,00000000003946-5,9033537744459E-17i"},{"$f":"20*LOG10(IMABS(Z13))","v":3.4274512546547312E-10},{"$f":"IMARGUMENT(Z13)*180/Pi","v":-3.3823725662152017E-15},null,{"$f":"IMPRODUCT((RdampCom*CdampCom+RdampCom*CinjCom),C13)","v":"0,000125663706i"},{"$f":"IMSUM(1,AD13)","v":"1+0,000125663706i"},{"$f":"IMPRODUCT(G13,L_infilterStd*RdampSel*CinjSel*CdampSel,E13)","v":{"$error":"#VALUE!"}},{"$f":"IMPRODUCT(G13,LAEFCom*CinjCom,D13)","v":{"$error":"#VALUE!"}},{"$f":"AE13","v":"1+0,000125663706i"},{"$f":"IMSUM(AF13:AH13)","v":{"$error":"#VALUE!"}},null,{"$f":"IMDIV(AE13,AI13)","v":{"$error":"#VALUE!"}},null,{"$f":"20*LOG10(IMABS(AK13))","v":{"$error":"#VALUE!"}},{"$f":"IMARGUMENT(AK13)*180/Pi","v":{"$error":"#VALUE!"}}]
[2,{"$f":"A14/1000","v":2E-3},"12,5663706i","-157,913670056544","-1984,40170073666i",null,{"$error":"#VALUE!"},null,{"$error":"#REF!"},{"$f":"IMSUM(1,I14)","v":{"$error":"#REF!"}},null,{"$error":"#VALUE!"},{"$error":"#VALUE!"},{"$f":"J14","v":{"$error":"#REF!"}},{"$f":"IMSUM(L14:N14)","v":{"$error":"#VALUE!"}},0,"1+0,00000439822971i","-2,21975174244403E-16i","-1,57850504588521E-10",{"$f":"IMSUM(S14,R14,Q14)","v":"0,999999999842149+4,39822970977802E-06i"},1,{"$f":"CHOOSE(INFILTER_TYPE,U14,IMDIV(J14,O14),IMDIV(Q14,T14))","v":1},{"$f":"20*LOG10(IMABS(V14))","v":0},0,null,"1,00000000015785-4,72284395630731E-16i",{"$f":"20*LOG10(IMABS(Z14))","v":1.3710672912527204E-9},-2.7059902626176745E-14,null,"0,000251327412i",{"$f":"IMSUM(1,AD14)","v":"1+0,000251327412i"},{"$error":"#VALUE!"},{"$error":"#VALUE!"},{"$f":"AE14","v":"1+0,000251327412i"},{"$f":"IMSUM(AF14:AH14)","v":{"$error":"#VALUE!"}},null,{"$f":"IMDIV(AE14,AI14)","v":{"$error":"#VALUE!"}},null,{"$f":"20*LOG10(IMABS(AK14))","v":{"$error":"#VALUE!"}},{"$error":"#VALUE!"}]
[3,3.0000000000000001E-3,"18,8495559i","-355,305757627225","-6697,35573998623i",null,{"$error":"#VALUE!"},null,{"$error":"#REF!"},{"$error":"#REF!"},null,{"$error":"#VALUE!"},{"$error":"#VALUE!"},{"$error":"#REF!"},{"$error":"#VALUE!"},0,"1+0,000006597344565i","-7,4916621307486E-16i","-3,55163635324174E-10","0,999999999644836+6,59734456425083E-06i",1,1,0,0,null,"1,00000000035516-1,59396947052946E-15i",3.0848797076462865E-9,-9.1327723405961694E-14,null,"0,000376991118i","1+0,000376991118i",{"$error":"#VALUE!"},{"$error":"#VALUE!"},"1+0,000376991118i",{"$error":"#VALUE!"},null,{"$error":"#VALUE!"},null,{"$error":"#VALUE!"},{"$error":"#VALUE!"}]
[4,4.0000000000000001E-3,"25,1327412i","-631,654680226178","-15875,2136058933i",null,{"$error":"#VALUE!"},null,{"$error":"#REF!"},{"$error":"#REF!"},null,{"$error":"#VALUE!"},{"$error":"#VALUE!"},{"$error":"#REF!"},{"$error":"#VALUE!"},0,"1+0,00000879645942i","-1,77580139395522E-15i","-6,31402018354088E-10","0,999999999368598+0,0000087964594182242i",1,1,0,0,null,"1,0000000006314-3,77830227167012E-15i",5.484271092367277E-9,-2.1648077400206861E-13,null,"0,000502654824i","1+0,000502654824i",{"$error":"#VALUE!"},{"$error":"#VALUE!"},"1+0,000502654824i",{"$error":"#VALUE!"},null,{"$error":"#VALUE!"},null,{"$error":"#VALUE!"},{"$error":"#VALUE!"}]
[5,5.0000000000000001E-3,"31,4159265i","-986,960437853402","-31006,2765740103i",null,{"$error":"#VALUE!"},null,{"$error":"#REF!"},{"$error":"#REF!"},null,{"$error":"#VALUE!"},{"$error":"#VALUE!"},{"$error":"#REF!"},{"$error":"#VALUE!"},0,"1+0,000010995574275i","-3,46836209756879E-15i","-9,86565653678261E-10","0,999999999013434+0,0000109955742715316i",1,1,0,0,null,"1,00000000098657-7,37945946308484E-15i",8.5692375875376739E-9,-4.2281188238863731E-13,null,"0,00062831853i","1+0,00062831853i",{"$error":"#VALUE!"},{"$error":"#VALUE!"},"1+0,00062831853i",{"$error":"#VALUE!"},null,{"$error":"#VALUE!"},null,{"$error":"#VALUE!"},{"$error":"#VALUE!"}]
[6,6.0000000000000001E-3,"37,6991118i","-1421,2230305089","-53578,8459198898i",null,{"$error":"#VALUE!"},null,{"$error":"#REF!"},{"$error":"#REF!"},null,{"$error":"#VALUE!"},{"$error":"#VALUE!"},{"$error":"#REF!"},{"$error":"#VALUE!"},0,"1+0,00001319468913i","-5,99332970459887E-15i","-1,4206545412967E-09","0,999999998579345+0,0000131946891240067i",1,1,0,0,null,"1,00000000142066-1,27518015159367E-14i",1.2339696260264985E-8,-7.3062440784858933E-13,null,"0,000753982236i","1+0,000753982236i",{"$error":"#VALUE!"},{"$error":"#VALUE!"},"1+0,000753982236i",{"$error":"#VALUE!"},null,{"$error":"#VALUE!"},null,{"$error":"#VALUE!"},{"$error":"#VALUE!"}]
[7,7.0000000000000001E-3,"43,9822971i","-1934,44245819267","-85081,2229190843i",null,{"$error":"#VALUE!"},null,{"$error":"#REF!"},{"$error":"#REF!"},null,{"$error":"#VALUE!"},{"$error":"#VALUE!"},{"$error":"#REF!"},{"$error":"#VALUE!"},0,"1+0,000015393803985i","-9,51718559572877E-15i","-1,93366868120939E-09","0,999999998066331+0,0000153938039754828i",1,1,0,0,null,"1,00000000193367-2,02493221373488E-14i",1.6795643252346658E-8,-1.1602006955531912E-12,null,"0,000879645942i","1+0,000879645942i",{"$error":"#VALUE!"},{"$error":"#VALUE!"},"1+0,000879645942i",{"$error":"#VALUE!"},null,{"$error":"#VALUE!"},null,{"$error":"#VALUE!"},{"$error":"#VALUE!"}]
[8,8.0000000000000002E-3,"50,2654824i","-2526,61872090471","-127001,708847146i",null,{"$error":"#VALUE!"},null,{"$error":"#REF!"},{"$error":"#REF!"},null,{"$error":"#VALUE!"},{"$error":"#VALUE!"},{"$error":"#REF!"},{"$error":"#VALUE!"},0,"1+0,00001759291884i","-1,42064111516417E-14i","-2,52560807341635E-09","0,999999997474392+0,0000175929188257936i",1,1,0,0,null,"1,00000000252561-3,02264148354676E-14i",2.1937169209509332E-8,-1.7318459974888673E-12,null,"0,001005309648i","1+0,001005309648i",{"$error":"#VALUE!"},{"$error":"#VALUE!"},"1+0,001005309648i",{"$error":"#VALUE!"},null,{"$error":"#VALUE!"},null,{"$error":"#VALUE!"},{"$error":"#VALUE!"}]
[9,8.9999999999999993E-3,"56,5486677i","-3197,75181864502","-180828,604979628i",null,{"$error":"#VALUE!"},null,{"$error":"#REF!"},{"$error":"#REF!"},null,{"$error":"#VALUE!"},{"$error":"#VALUE!"},{"$error":"#REF!"},{"$error":"#VALUE!"},0,"1+0,000019792033695i","-2,02274877530212E-14i","-3,19647271791756E-09","0,999999996803527+0,0000197920336747725i",1,1,0,0,null,"1,00000000319647-4,30372020696133E-14i",2.7764185412408903E-8,-2.4658500355761629E-12,null,"0,001130973354i","1+0,001130973354i",{"$error":"#VALUE!"},{"$error":"#VALUE!"},"1+0,001130973354i",{"$error":"#VALUE!"},null,{"$error":"#VALUE!"},null,{"$error":"#VALUE!"},{"$error":"#VALUE!"}]
[10,0.01,"62,831853i","-3947,84175141361","-248050,212592082i",null,{"$error":"#VALUE!"},null,{"$error":"#REF!"},{"$error":"#REF!"},null,{"$error":"#VALUE!"},{"$error":"#VALUE!"},{"$error":"#REF!"},{"$error":"#VALUE!"},0,"1+0,00002199114855i","-2,77468967805503E-14i","-3,94626261471304E-09","0,999999996053737+0,0000219911485222531i",1,1,0,0,null,"1,00000000394626-5,90359570729332E-14i",3.4276778649137416E-8,-3.3825111703113878E-12,null,"0,00125663706i","1+0,00125663706i",{"$error":"#VALUE!"},{"$error":"#VALUE!"},"1+0,00125663706i",{"$error":"#VALUE!"},null,{"$error":"#VALUE!"},null,{"$error":"#VALUE!"},{"$error":"#VALUE!"}]
[20,0.02,"125,663706i","-15791,3670056544","-1984401,70073666i",null,{"$error":"#VALUE!"},null,{"$error":"#REF!"},{"$error":"#REF!"},null,{"$error":"#VALUE!"},{"$error":"#VALUE!"},{"$error":"#REF!"},{"$error":"#VALUE!"},0,"1+0,0000439822971i","-2,21975174244403E-13i","-1,57850504588521E-08","0,99999998421495+0,0000439822968780248i",1,1,0,0,null,"1,00000001578505-4,72287580174405E-13i",1.3710720057442979E-7,-2.7060084664215768E-11,null,"0,00251327412i","1+0,00251327412i",{"$error":"#VALUE!"},{"$error":"#VALUE!"},"1+0,00251327412i",{"$error":"#VALUE!"},null,{"$error":"#VALUE!"},null,{"$error":"#VALUE!"},{"$error":"#VALUE!"}]
[30,0.03,"188,495559i","-35530,5757627225","-6697355,73998623i",null,{"$error":"#VALUE!"},null,{"$error":"#REF!"},{"$error":"#REF!"},null,{"$error":"#VALUE!"},{"$error":"#VALUE!"},{"$error":"#REF!"},{"$error":"#VALUE!"},0,"1+0,00006597344565i","-7,4916621307486E-13i","-3,55163635324174E-08","0,999999964483636+0,0000659734449008338i",1,1,0,0,null,"1,00000003551637-1,59397081397336E-12i",3.0849126526975555E-7,-9.1327797168431367E-11,null,"0,00376991118i","1+0,00376991118i",{"$error":"#VALUE!"},{"$error":"#VALUE!"},"1+0,00376991118i",{"$error":"#VALUE!"},null,{"$error":"#VALUE!"},null,{"$error":"#VALUE!"},{"$error":"#VALUE!"}]
[40,0.04,"251,327412i","-63165,4680226178","-15875213,6058933i",null,{"$error":"#VALUE!"},null,{"$error":"#REF!"},{"$error":"#REF!"},null,{"$error":"#VALUE!"},{"$error":"#VALUE!"},{"$error":"#REF!"},{"$error":"#VALUE!"},0,"1+0,0000879645942i","-1,77580139395522E-12i","-6,31402018354088E-08","0,999999936859798+0,0000879645924241986i",1,1,0,0,null,"1,00000006314021-3,77830129983406E-12i",5.4842887803037698E-7,-2.1648070478801279E-10,null,"0,00502654824i","1+0,00502654824i",{"$error":"#VALUE!"},{"$error":"#VALUE!"},"1+0,00502654824i",{"$error":"#VALUE!"},null,{"$error":"#VALUE!"},null,{"$error":"#VALUE!"},{"$error":"#VALUE!"}]
[50,0.05,"314,159265i","-98696,0437853402","-31006276,5740103i",null,{"$error":"#VALUE!"},null,{"$error":"#REF!"},{"$error":"#REF!"},null,{"$error":"#VALUE!"},{"$error":"#VALUE!"},{"$error":"#REF!"},{"$error":"#VALUE!"},0,"1+0,00010995574275i","-3,46836209756879E-12i","-9,86565653678261E-08","0,999999901343435+0,000109955739281638i",1,1,0,0,null,"1,00000009865657-7,37949525076775E-12i",8.5692003703246746E-7,-4.2281389157559421E-10,null,"0,0062831853i","1+0,0062831853i",{"$error":"#VALUE!"},{"$error":"#VALUE!"},"1+0,0062831853i",{"$error":"#VALUE!"},null,{"$error":"#VALUE!"},null,{"$error":"#VALUE!"},{"$error":"#VALUE!"}]
[60,0.06,"376,991118i","-142122,30305089","-53578845,9198898i",null,{"$error":"#VALUE!"},null,{"$error":"#REF!"},{"$error":"#REF!"},null,{"$error":"#VALUE!"},{"$error":"#VALUE!"},{"$error":"#REF!"},{"$error":"#VALUE!"},0,"1+0,0001319468913i","-5,99332970459887E-12i","-1,4206545412967E-07","0,999999857934546+0,00013194688530667i",1,1,0,0,null,"1,00000014206547-1,27517683815965E-11i",1.2339649066219747E-6,-7.3062240663248992E-10,null,"0,00753982236i","1+0,00753982236i",{"$error":"#VALUE!"},{"$error":"#VALUE!"},"1+0,00753982236i",{"$error":"#VALUE!"},null,{"$error":"#VALUE!"},null,{"$error":"#VALUE!"},{"$error":"#VALUE!"}]
[70,7.0000000000000007E-2,"439,822971i","-193444,245819267","-85081222,9190843i",null,{"$error":"#VALUE!"},null,{"$error":"#REF!"},{"$error":"#REF!"},null,{"$error":"#VALUE!"},{"$error":"#VALUE!"},{"$error":"#REF!"},{"$error":"#VALUE!"},0,"1+0,00015393803985i","-9,51718559572877E-12i","-1,93366868120939E-07","0,999999806633132+0,000153938030332814i",1,1,0,0,null,"1,0000001933669-2,02493379799158E-11i",1.6795633910819215E-6,-1.1602013811643187E-9,null,"0,00879645942i","1+0,00879645942i",{"$error":"#VALUE!"},{"$error":"#VALUE!"},"1+0,00879645942i",{"$error":"#VALUE!"},null,{"$error":"#VALUE!"},null,{"$error":"#VALUE!"},{"$error":"#VALUE!"}]
[80,0.08,"502,654824i","-252661,872090471","-127001708,847146i",null,{"$error":"#VALUE!"},null,{"$error":"#REF!"},{"$error":"#REF!"},null,{"$error":"#VALUE!"},{"$error":"#VALUE!"},{"$error":"#REF!"},{"$error":"#VALUE!"},0,"1+0,0001759291884i","-1,42064111516417E-11i","-2,52560807341635E-07","0,999999747439193+0,000175929174193589i",1,1,0,0,null,"1,00000025256087-3,02264211687963E-11i",2.1937155666510632E-6,-1.731845927339326E-9,null,"0,01005309648i","1+0,01005309648i",{"$error":"#VALUE!"},{"$error":"#VALUE!"},"1+0,01005309648i",{"$error":"#VALUE!"},null,{"$error":"#VALUE!"},null,{"$error":"#VALUE!"},{"$error":"#VALUE!"}]
[90,0.09,"565,486677i","-319775,181864502","-180828604,979628i",null,{"$error":"#VALUE!"},null,{"$error":"#REF!"},{"$error":"#REF!"},null,{"$error":"#VALUE!"},{"$error":"#VALUE!"},{"$error":"#REF!"},{"$error":"#VALUE!"},0,"1+0,00019792033695i","-2,02274877530212E-11i","-3,19647271791756E-07","0,999999680352728+0,000197920316722512i",1,1,0,0,null,"1,00000031964737-4,30372335896138E-11i",2.7764213343660625E-6,-2.4658510612183728E-9,null,"0,01130973354i","1+0,01130973354i",{"$error":"#VALUE!"},{"$error":"#VALUE!"},"1+0,01130973354i",{"$error":"#VALUE!"},null,{"$error":"#VALUE!"},null,{"$error":"#VALUE!"},{"$error":"#VALUE!"}]
[100,0.1,"628,31853i","-394784,175141361","-248050212,592082i",null,{"$error":"#VALUE!"},null,{"$error":"#REF!"},{"$error":"#REF!"},null,{"$error":"#VALUE!"},{"$error":"#VALUE!"},{"$error":"#REF!"},{"$error":"#VALUE!"},0,"1+0,0002199114855i","-2,77468967805503E-11i","-3,94626261471305E-07","0,999999605373739+0,000219911457753103i",1,1,0,0,null,"1,0000003946264-5,90359940073355E-11i",3.4276806823585146E-6,-3.382511965016509E-9,null,"0,0125663706i","1+0,0125663706i",{"$error":"#VALUE!"},{"$error":"#VALUE!"},"1+0,0125663706i",{"$error":"#VALUE!"},null,{"$error":"#VALUE!"},null,{"$error":"#VALUE!"},{"$error":"#VALUE!"}]
[200,0.2,"1256,63706i","-1579136,70056544","-1984401700,73666i",null,{"$error":"#VALUE!"},null,{"$error":"#REF!"},{"$error":"#REF!"},null,{"$error":"#VALUE!"},{"$error":"#VALUE!"},{"$error":"#REF!"},{"$error":"#VALUE!"},0,"1+0,000439822971i","-2,21975174244403E-10i","-1,57850504588521E-06","0,999998421494954+0,000439822749024826i",1,1,0,0,null,"1,00000157850733-4,72289004721146E-10i",1.3710729639650269E-5,-2.7060123997272546E-8,null,"0,0251327412i","1+0,0251327412i",{"$error":"#VALUE!"},{"$error":"#VALUE!"},"1+0,0251327412i",{"$error":"#VALUE!"},null,{"$error":"#VALUE!"},null,{"$error":"#VALUE!"},{"$error":"#VALUE!"}]
[300,0.3,"1884,95559i","-3553057,57627225","-6697355739,98623i",null,{"$error":"#VALUE!"},null,{"$error":"#REF!"},{"$error":"#REF!"},null,{"$error":"#VALUE!"},{"$error":"#VALUE!"},{"$error":"#REF!"},{"$error":"#VALUE!"},0,"1+0,0006597344565i","-7,4916621307486E-10i","-3,55163635324174E-06","0,999996448363647+0,000659733707333787i",1,1,0,0,null,"1,00000355164792-1,59398129480179E-09i",3.084916708360373E-5,-9.1328076554125626E-8,null,"0,0376991118i","1+0,0376991118i",{"$error":"#VALUE!"},{"$error":"#VALUE!"},"1+0,0376991118i",{"$error":"#VALUE!"},null,{"$error":"#VALUE!"},null,{"$error":"#VALUE!"},{"$error":"#VALUE!"}]
[400,0.4,"2513,27412i","-6316546,80226177","-15875213605,8933i",null,{"$error":"#VALUE!"},null,{"$error":"#REF!"},{"$error":"#REF!"},null,{"$error":"#VALUE!"},{"$error":"#VALUE!"},{"$error":"#REF!"},{"$error":"#VALUE!"},0,"1+0,000879645942i","-1,77580139395522E-09i","-6,31402018354087E-06","0,999993685979816+0,000879644166198606i",1,1,0,0,null,"1,00000631405673-3,77834562794476E-09i",5.4843026783634755E-5,-2.1648189139136651E-7,null,"0,0502654824i","1+0,0502654824i",{"$error":"#VALUE!"},{"$error":"#VALUE!"},"1+0,0502654824i",{"$error":"#VALUE!"},null,{"$error":"#VALUE!"},null,{"$error":"#VALUE!"},{"$error":"#VALUE!"}]
[500,0.5,"3141,59265i","-9869604,37853402","-31006276574,0103i",null,{"$error":"#VALUE!"},null,{"$error":"#REF!"},{"$error":"#REF!"},null,{"$error":"#VALUE!"},{"$error":"#VALUE!"},{"$error":"#REF!"},{"$error":"#VALUE!"},0,"1+0,0010995574275i","-3,46836209756879E-09i","-9,86565653678261E-06","0,999990134343463+0,0010995539591379i",1,1,0,0,null,"1,00000986574575-7,37963050952798E-09i",8.5692356072072088E-5,-4.228175116350063E-7,null,"0,062831853i","1+0,062831853i",{"$error":"#VALUE!"},{"$error":"#VALUE!"},"1+0,062831853i",{"$error":"#VALUE!"},null,{"$error":"#VALUE!"},null,{"$error":"#VALUE!"},{"$error":"#VALUE!"}]
[600,0.6,"3769,91118i","-14212230,305089","-53578845919,8898i",null,{"$error":"#VALUE!"},null,{"$error":"#REF!"},{"$error":"#REF!"},null,{"$error":"#VALUE!"},{"$error":"#VALUE!"},{"$error":"#REF!"},{"$error":"#VALUE!"},0,"1+0,001319468913i","-5,99332970459887E-09i","-0,000014206545412967","0,999985793454587+0,0013194629196703i",1,1,0,0,null,"1,00001420673042-1,27521054564846E-08i",1.2339721601309145E-4,-7.3063144351324126E-7,null,"0,0753982236i","1+0,0753982236i",{"$error":"#VALUE!"},{"$error":"#VALUE!"},"1+0,0753982236i",{"$error":"#VALUE!"},null,{"$error":"#VALUE!"},null,{"$error":"#VALUE!"},{"$error":"#VALUE!"}]
[700,0.7,"4398,22971i","-19344424,5819267","-85081222919,0843i",null,{"$error":"#VALUE!"},null,{"$error":"#REF!"},{"$error":"#REF!"},null,{"$error":"#VALUE!"},{"$error":"#VALUE!"},{"$error":"#REF!"},{"$error":"#VALUE!"},0,"1+0,0015393803985i","-9,51718559572877E-09i","-0,0000193366868120939","0,999980663313188+0,0015393708813144i",1,1,0,0,null,"1,00001933702955-2,02500661951286E-08i",1.6795768070547058E-4,-1.1602208939414706E-6,null,"0,0879645942i","1+0,0879645942i",{"$error":"#VALUE!"},{"$error":"#VALUE!"},"1+0,0879645942i",{"$error":"#VALUE!"},null,{"$error":"#VALUE!"},null,{"$error":"#VALUE!"},{"$error":"#VALUE!"}]
[800,0.8,"5026,54824i","-25266187,2090471","-127001708847,146i",null,{"$error":"#VALUE!"},null,{"$error":"#REF!"},{"$error":"#REF!"},null,{"$error":"#VALUE!"},{"$error":"#VALUE!"},{"$error":"#REF!"},{"$error":"#VALUE!"},0,"1+0,001759291884i","-1,42064111516417E-08i","-0,0000252560807341635","0,999974743919266+0,00175927767758885i",1,1,0,0,null,"1,00002525666544-3,02278400042037E-08i",2.1937383832667357E-4,-1.7318839164039424E-6,null,"0,1005309648i","1+0,1005309648i",{"$error":"#VALUE!"},{"$error":"#VALUE!"},"1+0,1005309648i",{"$error":"#VALUE!"},null,{"$error":"#VALUE!"},null,{"$error":"#VALUE!"},{"$error":"#VALUE!"}]
[900,0.9,"5654,86677i","-31977518,1864502","-180828604979,628i",null,{"$error":"#VALUE!"},null,{"$error":"#REF!"},{"$error":"#REF!"},null,{"$error":"#VALUE!"},{"$error":"#VALUE!"},{"$error":"#REF!"},{"$error":"#VALUE!"},0,"1+0,0019792033695i","-2,02274877530212E-08i","-0,0000319647271791756","0,999968035272821+0,00197918314201225i",1,1,0,0,null,"1,00003196566377-4,30397908600739E-08i",2.7764579017865241E-4,-2.4659195454707077E-6,null,"0,1130973354i","1+0,1130973354i",{"$error":"#VALUE!"},{"$error":"#VALUE!"},"1+0,1130973354i",{"$error":"#VALUE!"},null,{"$error":"#VALUE!"},null,{"$error":"#VALUE!"},{"$error":"#VALUE!"}]
[1000,1,"6283,1853i","-39478417,5141361","-248050212592,082i",null,{"$error":"#VALUE!"},null,{"$error":"#REF!"},{"$error":"#REF!"},null,{"$error":"#VALUE!"},{"$error":"#VALUE!"},{"$error":"#REF!"},{"$error":"#VALUE!"},0,"1+0,002199114855i","-2,77468967805503E-08i","-0,0000394626261471304","0,999960537373853+0,00219908710810322i",1,1,0,0,null,"1,00003946405367-5,90403247598128E-08i",3.4277365128982361E-4,-3.3826279414737456E-6,null,"0,125663706i","1+0,125663706i",{"$error":"#VALUE!"},{"$error":"#VALUE!"},"1+0,125663706i",{"$error":"#VALUE!"},null,{"$error":"#VALUE!"},null,{"$error":"#VALUE!"},{"$error":"#VALUE!"}]
[2000,2,"12566,3706i","-157913670,056544","-1984401700736,66i",null,{"$error":"#VALUE!"},null,{"$error":"#REF!"},{"$error":"#REF!"},null,{"$error":"#VALUE!"},{"$error":"#VALUE!"},{"$error":"#REF!"},{"$error":"#VALUE!"},0,"1+0,00439822971i","-2,21975174244403E-07i","-0,000157850504588521","0,999842149495412+0,00439800773482576i",1,1,0,0,null,"1,00015787334724-4,72427600959129E-07i",1.3711622397485389E-3,-2.7063835033150666E-5,null,"0,251327412i","1+0,251327412i",{"$error":"#VALUE!"},{"$error":"#VALUE!"},"1+0,251327412i",{"$error":"#VALUE!"},null,{"$error":"#VALUE!"},null,{"$error":"#VALUE!"},{"$error":"#VALUE!"}]
[3000,3,"18849,5559i","-355305757,627225","-6697355739986,23i",null,{"$error":"#VALUE!"},null,{"$error":"#REF!"},{"$error":"#REF!"},null,{"$error":"#VALUE!"},{"$error":"#VALUE!"},{"$error":"#REF!"},{"$error":"#VALUE!"},0,"1+0,006597344565i","-7,4916621307486E-07i","-0,000355163635324174","0,999644836364676+0,00659659539878692i",1,1,0,0,null,"1,00035527929582-1,59503405307709E-06i",3.0853687138606856E-3,-9.135626253668961E-5,null,"0,376991118i","1+0,376991118i",{"$error":"#VALUE!"},{"$error":"#VALUE!"},"1+0,376991118i",{"$error":"#VALUE!"},null,{"$error":"#VALUE!"},null,{"$error":"#VALUE!"},{"$error":"#VALUE!"}]
[4000,4,"25132,7412i","-631654680,226177","-15875213605893,3i",null,{"$error":"#VALUE!"},null,{"$error":"#REF!"},{"$error":"#REF!"},null,{"$error":"#VALUE!"},{"$error":"#VALUE!"},{"$error":"#REF!"},{"$error":"#VALUE!"},0,"1+0,00879645942i","-1,77580139395522E-06i","-0,000631402018354087","0,999368597981646+0,00879468361860604i",1,1,0,0,null,"1,00063176764934-3,78278365967147E-06i",5.4857314697180446E-3,-2.1660069744338419E-4,null,"0,502654824i","1+0,502654824i",{"$error":"#VALUE!"},{"$error":"#VALUE!"},"1+0,502654824i",{"$error":"#VALUE!"},null,{"$error":"#VALUE!"},null,{"$error":"#VALUE!"},{"$error":"#VALUE!"}]
[5000,5,"31415,9265i","-986960437,853402","-31006276574010,3i",null,{"$error":"#VALUE!"},null,{"$error":"#REF!"},{"$error":"#REF!"},null,{"$error":"#VALUE!"},{"$error":"#VALUE!"},{"$error":"#REF!"},{"$error":"#VALUE!"},0,"1+0,010995574275i","-3,46836209756879E-06i","-0,000986565653678261","0,999013434346322+0,0109921059129024i",1,1,0,0,null,"1,00098745857977-7,39318105431537E-06i",8.5727245740982051E-3,-4.2318019914624398E-4,null,"0,62831853i","1+0,62831853i",{"$error":"#VALUE!"},{"$error":"#VALUE!"},"1+0,62831853i",{"$error":"#VALUE!"},null,{"$error":"#VALUE!"},null,{"$error":"#VALUE!"},{"$error":"#VALUE!"}]
[6000,6,{"$f":"COMPLEX(0,2*Pi*A45)","v":"37699,1118i"},{"$f":"COMPLEX(-POWER(2*Pi*A45,2),0)","v":"-1421223030,5089"},{"$f":"COMPLEX(0,-POWER(2*Pi*A45,3))","v":"-53578845919889,8i"},null,{"$f":"IMSUM(IMPRODUCT(C45,Rcomp_AEF*Csen_AEF),Csen_AEF/Ccomp_AEF)","v":{"$error":"#VALUE!"}},null,{"$f":"IMPRODUCT((RdampSel*CdampSel+RdampSel*CinjSel),C45)","v":{"$error":"#REF!"}},{"$error":"#REF!"},null,{"$f":"IMPRODUCT(G45,L_infilterStd*RdampSel*CinjSel*CdampSel,E45)","v":{"$error":"#VALUE!"}},{"$f":"IMPRODUCT(G45,L_infilterStd*CinjSel,D45)","v":{"$error":"#VALUE!"}},{"$error":"#REF!"},{"$error":"#VALUE!"},0,{"$f":"IMSUM(IMPRODUCT(C45,RdampPssv*CdampPssv),1)","v":"1+0,01319468913i"},{"$f":"IMPRODUCT(RdampPssv*CdampPssv*CfilterPssv*LinfilterPssv,E45)","v":"-5,99332970459887E-06i"},{"$f":"IMPRODUCT(D45,LinfilterPssv*(CfilterPssv+CdampPssv))","v":"-0,0014206545412967"},"0,998579345458703+0,0131886958002954i",1,{"$f":"CHOOSE(INFILTER_TYPE,U45,IMDIV(J45,O45),IMDIV(Q45,T45))","v":1},0,{"$f":"IMARGUMENT(V45)*180/Pi","v":0},null,{"$f":"IMDIV(Q45,T45)","v":"1,00142250680344-0,000012785844067251i"},1.2346958077157324E-2,{"$f":"IMARGUMENT(Z45)*180/Pi","v":-7.3153429085745297E-4},null,{"$f":"IMPRODUCT((RdampCom*CdampCom+RdampCom*CinjCom),C45)","v":"0,753982236i"},"1+0,753982236i",{"$f":"IMPRODUCT(G45,L_infilterStd*RdampSel*CinjSel*CdampSel,E45)","v":{"$error":"#VALUE!"}},{"$f":"IMPRODUCT(G45,LAEFCom*CinjCom,D45)","v":{"$error":"#VALUE!"}},"1+0,753982236i",{"$error":"#VALUE!"},null,{"$error":"#VALUE!"},null,{"$error":"#VALUE!"},{"$f":"IMARGUMENT(AK45)*180/Pi","v":{"$error":"#VALUE!"}}]
[7000,7,"43982,2971i","-1934442458,19267","-85081222919084,3i",null,{"$error":"#VALUE!"},null,{"$error":"#REF!"},{"$error":"#REF!"},null,{"$error":"#VALUE!"},{"$error":"#VALUE!"},{"$error":"#REF!"},{"$error":"#VALUE!"},0,"1+0,015393803985i","-9,51718559572877E-06i","-0,00193366868120939","0,998066331318791+0,0153842867994043i",1,1,0,0,null,"1,00193710173868-0,0000203230411399365i",1.680917841515581E-2,-1.1621732375608322E-3,null,"0,879645942i","1+0,879645942i",{"$error":"#VALUE!"},{"$error":"#VALUE!"},"1+0,879645942i",{"$error":"#VALUE!"},null,{"$error":"#VALUE!"},null,{"$error":"#VALUE!"},{"$error":"#VALUE!"}]
[8000,8,"50265,4824i","-2526618720,90471","-127001708847146i",null,{"$error":"#VALUE!"},null,{"$error":"#REF!"},{"$error":"#REF!"},null,{"$error":"#VALUE!"},{"$error":"#VALUE!"},{"$error":"#REF!"},{"$error":"#VALUE!"},0,"1+0,01759291884i","-0,0000142064111516418i","-0,00252560807341635","0,997474391926584+0,0175787124288484i",1,1,0,0,null,"1,00253146769905-0,0000303702348632679i",2.1960268903701091E-2,-1.7356924326137229E-3,null,"1,005309648i","1+1,005309648i",{"$error":"#VALUE!"},{"$error":"#VALUE!"},"1+1,005309648i",{"$error":"#VALUE!"},null,{"$error":"#VALUE!"},null,{"$error":"#VALUE!"},{"$error":"#VALUE!"}]
[9000,9,"56548,6677i","-3197751818,64502","-180828604979628i",null,{"$error":"#VALUE!"},null,{"$error":"#REF!"},{"$error":"#REF!"},null,{"$error":"#VALUE!"},{"$error":"#VALUE!"},{"$error":"#REF!"},{"$error":"#VALUE!"},0,"1+0,019792033695i","-0,0000202274877530212i","-0,00319647271791756","0,996803527282082+0,019771806207247i",1,1,0,0,null,"1,00320586412249-0,0000432966329094656i",2.7801250322054171E-2,-2.4727869152797537E-3,null,"1,130973354i","1+1,130973354i",{"$error":"#VALUE!"},{"$error":"#VALUE!"},"1+1,130973354i",{"$error":"#VALUE!"},null,{"$error":"#VALUE!"},null,{"$error":"#VALUE!"},{"$error":"#VALUE!"}]
[10000,10,"62831,853i","-3947841751,41361","-248050212592082i",null,{"$error":"#VALUE!"},null,{"$error":"#REF!"},{"$error":"#REF!"},null,{"$error":"#VALUE!"},{"$error":"#VALUE!"},{"$error":"#REF!"},{"$error":"#VALUE!"},0,"1+0,02199114855i","-0,0000277468967805503i","-0,00394626261471305","0,996053737385287+0,0219634016532194i",1,1,0,0,null,"1,0039605858368-0,0000594757476545141i",3.4333281589256678E-2,-3.394266041884357E-3,null,"1,25663706i","1+1,25663706i",{"$error":"#VALUE!"},{"$error":"#VALUE!"},"1+1,25663706i",{"$error":"#VALUE!"},null,{"$error":"#VALUE!"},null,{"$error":"#VALUE!"},{"$error":"#VALUE!"}]
[11000,11,"69115,0383i","-4776888519,21047","-330154832960062i",null,{"$error":"#VALUE!"},null,{"$error":"#REF!"},{"$error":"#REF!"},null,{"$error":"#VALUE!"},{"$error":"#VALUE!"},{"$f":"J50","v":{"$error":"#REF!"}},{"$f":"IMSUM(L50:N50)","v":{"$error":"#VALUE!"}},0,"1+0,024190263405i","-0,0000369311196149125i","-0,00477497776380279",{"$f":"IMSUM(S50,R50,Q50)","v":"0,995225022236197+0,0241533322853851i"},1,1,0,0,null,"1,00479596336193-0,0000792859658181959i",4.1557660533084087E-2,-4.5210683336785549E-3,null,"1,382300766i","1+1,382300766i",{"$error":"#VALUE!"},{"$error":"#VALUE!"},"1+1,382300766i",{"$error":"#VALUE!"},null,{"$error":"#VALUE!"},null,{"$error":"#VALUE!"},{"$error":"#VALUE!"}]
[12000,12,"75398,2236i","-5684892122,0356","-428630767359119i",null,{"$error":"#VALUE!"},null,{"$error":"#REF!"},{"$error":"#REF!"},null,{"$error":"#VALUE!"},{"$error":"#VALUE!"},{"$f":"J51","v":{"$error":"#REF!"}},{"$f":"IMSUM(L51:N51)","v":{"$error":"#VALUE!"}},0,"1+0,02638937826i","-0,000047946637636791i","-0,00568261816518679",{"$f":"IMSUM(S51,R51,Q51)","v":"0,994317381834813+0,0263414316223632i"},1,1,0,0,null,"1,00571236324959-0,000103111129481765i",4.9475824752593413E-2,-5.8742765248443194E-3,null,"1,507964472i","1+1,507964472i",{"$error":"#VALUE!"},{"$error":"#VALUE!"},"1+1,507964472i",{"$error":"#VALUE!"},null,{"$error":"#VALUE!"},null,{"$error":"#VALUE!"},{"$error":"#VALUE!"}]
[13000,13,"81681,4089i","-6671852559,889","-544966317064805i",null,{"$error":"#VALUE!"},null,{"$error":"#REF!"},{"$error":"#REF!"},null,{"$error":"#VALUE!"},{"$error":"#VALUE!"},{"$f":"J52","v":{"$error":"#REF!"}},{"$f":"IMSUM(L52:N52)","v":{"$error":"#VALUE!"}},0,"1+0,028588493115i","-0,0000609599322268691i","-0,00666918381886504",{"$f":"IMSUM(S52,R52,Q52)","v":"0,993330816181135+0,0285275331827731i"},1,1,0,0,null,"1,00671018846073-0,00013134112988737i",5.808935257490936E-2,-7.4751328348372729E-3,null,"1,633628178i","1+1,633628178i",{"$error":"#VALUE!"},{"$error":"#VALUE!"},"1+1,633628178i",{"$error":"#VALUE!"},null,{"$error":"#VALUE!"},null,{"$error":"#VALUE!"},{"$error":"#VALUE!"}]
[15000,15,"94247,7795i","-8882643940,68062","-837169467498278i",null,{"$error":"#VALUE!"},null,{"$error":"#REF!"},{"$error":"#REF!"},null,{"$error":"#VALUE!"},{"$error":"#VALUE!"},{"$f":"J53","v":{"$error":"#REF!"}},{"$f":"IMSUM(L53:N53)","v":{"$error":"#VALUE!"}},0,"1+0,032986722825i","-0,0000936457766343574i","-0,00887909088310435",{"$f":"IMSUM(S53,R53,Q53)","v":"0,991120909116896+0,0328930770483656i"},1,1,0,0,null,"1,00895191127968-0,00020260911556929i",7.7409522394356958E-2,-1.1505649516535831E-2,null,"1,88495559i","1+1,88495559i",{"$error":"#VALUE!"},{"$error":"#VALUE!"},"1+1,88495559i",{"$error":"#VALUE!"},null,{"$error":"#VALUE!"},null,{"$error":"#VALUE!"},{"$error":"#VALUE!"}]
[16000,16,"100530,9648i","-10106474883,6188","-1016013670777170i",null,{"$error":"#VALUE!"},null,{"$error":"#REF!"},{"$error":"#REF!"},null,{"$error":"#VALUE!"},{"$error":"#VALUE!"},{"$f":"J54","v":{"$error":"#REF!"}},{"$f":"IMSUM(L54:N54)","v":{"$error":"#VALUE!"}},0,"1+0,03518583768i","-0,000113651289213134i","-0,0101024322936654",{"$f":"IMSUM(S54,R54,Q54)","v":"0,989897567706335+0,0350721863907869i"},1,1,0,0,null,"1,01019680079824-0,000246462681525396i",8.8120034652894183E-2,-1.3978732840646416E-2,null,"2,010619296i","1+2,010619296i",{"$error":"#VALUE!"},{"$error":"#VALUE!"},"1+2,010619296i",{"$error":"#VALUE!"},null,{"$error":"#VALUE!"},null,{"$error":"#VALUE!"},{"$error":"#VALUE!"}]
[17500,17.5,"109955,74275i","-12090265363,7042","-1329394108110690i",null,{"$error":"#VALUE!"},null,{"$error":"#REF!"},{"$error":"#REF!"},null,{"$error":"#VALUE!"},{"$error":"#VALUE!"},{"$error":"#REF!"},{"$error":"#VALUE!"},0,"1+0,0384845099625i","-0,000148706024933262i","-0,0120854292575587","0,987914570742441+0,0383358039375667i",1,1,0,0,null,"1,01222071263725-0,000323696833892721i",0.10550484102978921,-1.8322547228315767E-2,null,"2,199114855i","1+2,199114855i",{"$error":"#VALUE!"},{"$error":"#VALUE!"},"1+2,199114855i",{"$error":"#VALUE!"},null,{"$error":"#VALUE!"},null,{"$error":"#VALUE!"},{"$error":"#VALUE!"}]
[19000,19,"119380,5207i","-14251708722,6031","-1701376408169090i",null,{"$error":"#VALUE!"},null,{"$error":"#REF!"},{"$error":"#REF!"},null,{"$error":"#VALUE!"},{"$error":"#VALUE!"},{"$error":"#REF!"},{"$error":"#VALUE!"},0,"1+0,041783182245i","-0,000190315965017794i","-0,0142460080391141","0,985753991960886+0,0415928662799822i",1,1,0,0,null,"1,01443433812182-0,000415975520938413i",0.12447955922984369,-2.3494512681856306E-2,null,"2,387610414i","1+2,387610414i",{"$error":"#VALUE!"},{"$error":"#VALUE!"},"1+2,387610414i",{"$error":"#VALUE!"},null,{"$error":"#VALUE!"},null,{"$error":"#VALUE!"},{"$error":"#VALUE!"}]
[20000,20,"125663,706i","-15791367005,6544","-1984401700736660i",null,{"$error":"#VALUE!"},null,{"$error":"#REF!"},{"$error":"#REF!"},null,{"$error":"#VALUE!"},{"$error":"#VALUE!"},{"$error":"#REF!"},{"$error":"#VALUE!"},0,"1+0,0439822971i","-0,000221975174244403i","-0,0157850504588521","0,984214949541148+0,0437603219257556i",1,1,0,0,null,"1,01601657935512-0,000486596443905099i",0.13801689257265934,-2.744041881657654E-2,null,"2,51327412i","1+2,51327412i",{"$error":"#VALUE!"},{"$error":"#VALUE!"},"1+2,51327412i",{"$error":"#VALUE!"},null,{"$error":"#VALUE!"},null,{"$error":"#VALUE!"},{"$error":"#VALUE!"}]
[25000,25,"157079,6325i","-24674010946,3351","-3875784571751290i",null,{"$error":"#VALUE!"},null,{"$error":"#REF!"},{"$error":"#REF!"},null,{"$error":"#VALUE!"},{"$error":"#VALUE!"},{"$error":"#REF!"},{"$error":"#VALUE!"},0,"1+0,054977871375i","-0,000433545262196099i","-0,0246641413419566","0,975335858658043+0,0545443261128039i",1,1,0,0,null,"1,02523378537434-0,000966656304033977i",0.21646204909008521,-5.4022127344881758E-2,null,"3,14159265i","1+3,14159265i",{"$error":"#VALUE!"},{"$error":"#VALUE!"},"1+3,14159265i",{"$error":"#VALUE!"},null,{"$error":"#VALUE!"},null,{"$error":"#VALUE!"},{"$error":"#VALUE!"}]
[30000,30,"188495,559i","-35530575762,7225","-6697355739986230i",null,{"$error":"#VALUE!"},null,{"$error":"#REF!"},{"$error":"#REF!"},null,{"$error":"#VALUE!"},{"$error":"#VALUE!"},{"$error":"#REF!"},{"$error":"#VALUE!"},0,"1+0,06597344565i","-0,00074916621307486i","-0,0355163635324174","0,964483636467583+0,0652242794369251i",1,1,0,0,null,"1,03670887459481-0,00170572482425677i",0.31314808208663503,-9.4270192682177109E-2,null,"3,76991118i","1+3,76991118i",{"$error":"#VALUE!"},{"$error":"#VALUE!"},"1+3,76991118i",{"$error":"#VALUE!"},null,{"$error":"#VALUE!"},null,{"$error":"#VALUE!"},{"$error":"#VALUE!"}]
[35000,35,"219911,4855i","-48361061454,8167","-10635152864885500i",null,{"$error":"#VALUE!"},null,{"$error":"#REF!"},{"$error":"#REF!"},null,{"$error":"#VALUE!"},{"$error":"#VALUE!"},{"$error":"#REF!"},{"$error":"#VALUE!"},0,"1+0,076969019925i","-0,00118964819946609i","-0,0483417170302348","0,951658282969765+0,0757793717255339i",1,1,0,0,null,"1,05057619978726-0,00277724104542023i",0.42858150735745315,-0.15146337803870516,null,"4,39822971i","1+4,39822971i",{"$error":"#VALUE!"},{"$error":"#VALUE!"},"1+4,39822971i",{"$error":"#VALUE!"},null,{"$error":"#VALUE!"},null,{"$error":"#VALUE!"},{"$error":"#VALUE!"}]
[40000,40,"251327,412i","-63165468022,6178","-15875213605893300i",null,{"$error":"#VALUE!"},null,{"$error":"#REF!"},{"$error":"#REF!"},null,{"$error":"#VALUE!"},{"$error":"#VALUE!"},{"$error":"#REF!"},{"$error":"#VALUE!"},0,"1+0,0879645942i","-0,00177580139395522i","-0,0631402018354088","0,936859798164591+0,0861887928060448i",1,1,0,0,null,"1,06700286965865-0,00426861635465528i",0.56338125510820847,-0.22921437604912545,null,"5,02654824i","1+5,02654824i",{"$error":"#VALUE!"},{"$error":"#VALUE!"},"1+5,02654824i",{"$error":"#VALUE!"},null,{"$error":"#VALUE!"},null,{"$error":"#VALUE!"},{"$error":"#VALUE!"}]
[45000,45,"282743,3385i","-79943795466,1256","-22603575622453500i",null,{"$error":"#VALUE!"},null,{"$error":"#REF!"},{"$error":"#REF!"},null,{"$error":"#VALUE!"},{"$error":"#VALUE!"},{"$error":"#REF!"},{"$error":"#VALUE!"},0,"1+0,098960168475i","-0,00252843596912765i","-0,0799118179479392","0,920088182052061+0,0964317325058724i",1,1,0,0,null,"1,08619356566251-0,00628565719175738i",0.71828994959670589,-0.33155932819996564,null,"5,65486677i","1+5,65486677i",{"$error":"#VALUE!"},{"$error":"#VALUE!"},"1+5,65486677i",{"$error":"#VALUE!"},null,{"$error":"#VALUE!"},null,{"$error":"#VALUE!"},{"$error":"#VALUE!"}]
[50000,50,"314159,265i","-98696043785,3402","-31006276574010300i",null,{"$error":"#VALUE!"},null,{"$error":"#REF!"},{"$error":"#REF!"},null,{"$error":"#VALUE!"},{"$error":"#VALUE!"},{"$error":"#REF!"},{"$error":"#VALUE!"},0,"1+0,10995574275i","-0,00346836209756879i","-0,0986565653678261","0,901343434632174+0,106487380652431i",1,1,0,0,null,"1,10839666057698-0,00895831050462997i",0.89418785513768861,-0.46306726345210286,null,"6,2831853i","1+6,2831853i",{"$error":"#VALUE!"},{"$error":"#VALUE!"},"1+6,2831853i",{"$error":"#VALUE!"},null,{"$error":"#VALUE!"},null,{"$error":"#VALUE!"},{"$error":"#VALUE!"}]
[55000,55,"345575,1915i","-119422212980,262","-41269354120007700i",null,{"$error":"#VALUE!"},null,{"$error":"#REF!"},{"$error":"#REF!"},null,{"$error":"#VALUE!"},{"$error":"#VALUE!"},{"$error":"#REF!"},{"$error":"#VALUE!"},0,"1+0,120951317025i","-0,00461638995186406i","-0,11937444409507","0,88062555590493+0,116334927073136i",1,1,0,0,null,"1,1339119415625-0,0124482487823856i",1.0921099587044569,-0.628976061964027,null,"6,91150383i","1+6,91150383i",{"$error":"#VALUE!"},{"$error":"#VALUE!"},"1+6,91150383i",{"$error":"#VALUE!"},null,{"$error":"#VALUE!"},null,{"$error":"#VALUE!"},{"$error":"#VALUE!"}]
[60000,60,"376991,118i","-142122303050,89","-53578845919889800i",null,{"$error":"#VALUE!"},null,{"$error":"#REF!"},{"$error":"#REF!"},null,{"$error":"#VALUE!"},{"$error":"#VALUE!"},{"$error":"#REF!"},{"$error":"#VALUE!"},0,"1+0,1319468913i","-0,00599332970459887i","-0,14206545412967","0,85793454587033+0,125953561595401i",1,1,0,0,null,"1,1631003258263-0,0169590294511739i",1.3132667689997053,-0.83536384612322845,null,"7,53982236i","1+7,53982236i",{"$error":"#VALUE!"},{"$error":"#VALUE!"},"1+7,53982236i",{"$error":"#VALUE!"},null,{"$error":"#VALUE!"},null,{"$error":"#VALUE!"},{"$error":"#VALUE!"}]
[65000,65,"408407,0445i","-166796313997,225","-68120789633100600i",null,{"$error":"#VALUE!"},null,{"$error":"#REF!"},{"$error":"#REF!"},null,{"$error":"#VALUE!"},{"$error":"#VALUE!"},{"$error":"#REF!"},{"$error":"#VALUE!"},0,"1+0,142942465575i","-0,00761999152835863i","-0,166729595471626","0,833270404528374+0,135322474046641i",1,1,0,0,null,"1,19639605981863-0,0227498889631618i",1.5590695347266561,-1.0893679748558442,null,"8,16814089i","1+8,16814089i",{"$error":"#VALUE!"},{"$error":"#VALUE!"},"1+8,16814089i",{"$error":"#VALUE!"},null,{"$error":"#VALUE!"},null,{"$error":"#VALUE!"},{"$error":"#VALUE!"}]
[70000,70,"439822,971i","-193444245819,267","-85081222919084300i",null,{"$error":"#VALUE!"},null,{"$error":"#REF!"},{"$error":"#REF!"},null,{"$error":"#VALUE!"},{"$error":"#VALUE!"},{"$error":"#REF!"},{"$error":"#VALUE!"},0,"1+0,15393803985i","-0,00951718559572877i","-0,193366868120939","0,806633131879061+0,144420854254271i",1,1,0,0,null,"1,23432201043572-0,0301547238275632i",1.8311607132208529,-1.3994685289579945,null,"8,79645942i","1+8,79645942i",{"$error":"#VALUE!"},{"$error":"#VALUE!"},"1+8,79645942i",{"$error":"#VALUE!"},null,{"$error":"#VALUE!"},null,{"$error":"#VALUE!"},{"$error":"#VALUE!"}]
[75000,75,"471238,8975i","-222066098517,016","-104646183437285000i",null,{"$error":"#VALUE!"},null,{"$error":"#REF!"},{"$error":"#REF!"},null,{"$error":"#VALUE!"},{"$error":"#VALUE!"},{"$error":"#REF!"},{"$error":"#VALUE!"},0,"1+0,164933614125i","-0,0117057220792947i","-0,221977272077609","0,778022727922391+0,153227892045705i",1,1,0,0,null,"1,27750877655212-0,0396085636961541i",2.1314506343374608,-1.775860031243816,null,"9,42477795i","1+9,42477795i",{"$error":"#VALUE!"},{"$error":"#VALUE!"},"1+9,42477795i",{"$error":"#VALUE!"},null,{"$error":"#VALUE!"},null,{"$error":"#VALUE!"},{"$error":"#VALUE!"}]
[80000,80,"502654,824i","-252661872090,471","-127001708847146000i",null,{"$error":"#VALUE!"},null,{"$error":"#REF!"},{"$error":"#REF!"},null,{"$error":"#VALUE!"},{"$error":"#VALUE!"},{"$error":"#REF!"},{"$error":"#VALUE!"},0,"1+0,1759291884i","-0,0142064111516417i","-0,252560807341635","0,747439192658365+0,161722777248358i",1,1,0,0,null,"1,32671843606306-0,0516850094110243i",2.4621613570964245,-2.2309452403961947,null,"10,05309648i","1+10,05309648i",{"$error":"#VALUE!"},{"$error":"#VALUE!"},"1+10,05309648i",{"$error":"#VALUE!"},null,{"$error":"#VALUE!"},null,{"$error":"#VALUE!"},{"$error":"#VALUE!"}]
[90000,90,"565486,677i","-319775181864,502","-180828604979628000i",null,{"$error":"#VALUE!"},null,{"$error":"#REF!"},{"$error":"#REF!"},null,{"$error":"#VALUE!"},{"$error":"#VALUE!"},{"$error":"#REF!"},{"$error":"#VALUE!"},0,"1+0,19792033695i","-0,0202274877530212i","-0,319647271791756","0,680352728208244+0,177692849196979i",1,1,0,0,null,"1,44709298035524-0,0870397594174791i",3.2256122149724868,-3.4420800766964819,null,"11,30973354i","1+11,30973354i",{"$error":"#VALUE!"},{"$error":"#VALUE!"},"1+11,30973354i",{"$error":"#VALUE!"},null,{"$error":"#VALUE!"},null,{"$error":"#VALUE!"},{"$error":"#VALUE!"}]
[100000,100,"628318,53i","-394784175141,361","-248050212592082000i",null,{"$error":"#VALUE!"},null,{"$error":"#REF!"},{"$error":"#REF!"},null,{"$error":"#VALUE!"},{"$error":"#VALUE!"},{"$error":"#REF!"},{"$error":"#VALUE!"},0,"1+0,2199114855i","-0,0277468967805503i","-0,394626261471305","0,605373738528695+0,19216458871945i",1,1,0,0,null,"1,60541786286688-0,146344269997555i",4.1477004385549856,-5.208487782900634,null,"12,5663706i","1+12,5663706i",{"$error":"#VALUE!"},{"$error":"#VALUE!"},"1+12,5663706i",{"$error":"#VALUE!"},null,{"$error":"#VALUE!"},null,{"$error":"#VALUE!"},{"$error":"#VALUE!"}]
[110000,110,"691150,383i","-477688851921,047","-330154832960062000i",null,{"$error":"#VALUE!"},null,{"$error":"#REF!"},{"$error":"#REF!"},null,{"$error":"#VALUE!"},{"$error":"#VALUE!"},{"$f":"J72","v":{"$error":"#REF!"}},{"$f":"IMSUM(L72:N72)","v":{"$error":"#VALUE!"}},1,"1+0,24190263405i","-0,0369311196149125i","-0,477497776380279",{"$f":"IMSUM(S72,R72,Q72)","v":"0,522502223619721+0,204971514435088i"},1,1,0,0,null,"1,81601781079008-0,249432980334241i",5.2635704959533189,-7.8207323086855629,null,"13,82300766i","1+13,82300766i",{"$error":"#VALUE!"},{"$error":"#VALUE!"},"1+13,82300766i",{"$error":"#VALUE!"},null,{"$error":"#VALUE!"},null,{"$error":"#VALUE!"},{"$error":"#VALUE!"}]
[120000,120,"753982,236i","-568489212203,56","-428630767359118000i",null,{"$error":"#VALUE!"},null,{"$error":"#REF!"},{"$error":"#REF!"},null,{"$error":"#VALUE!"},{"$error":"#VALUE!"},{"$error":"#REF!"},{"$error":"#VALUE!"},2,"1+0,2638937826i","-0,0479466376367909i","-0,568261816518679","0,431738183481321+0,215947144963209i",1,1,0,0,null,"2,09725415352119-0,43777055480966i",6.6182385434260986,-11.79034914070173,null,"15,07964472i","1+15,07964472i",{"$error":"#VALUE!"},{"$error":"#VALUE!"},"1+15,07964472i",{"$error":"#VALUE!"},null,{"$error":"#VALUE!"},null,{"$error":"#VALUE!"},{"$error":"#VALUE!"}]
[130000,130,"816814,089i","-667185255988,9","-544966317064805000i",null,{"$error":"#VALUE!"},null,{"$error":"#REF!"},{"$error":"#REF!"},null,{"$error":"#VALUE!"},{"$error":"#VALUE!"},{"$error":"#REF!"},{"$error":"#VALUE!"},3,"1+0,28588493115i","-0,0609599322268691i","-0,666918381886505","0,333081618113495+0,224924998923131i",1,1,0,0,null,"2,4600564712321-0,802936137717432i",8.2585333921617039,-18.076129196132914,null,"16,33628178i","1+16,33628178i",{"$error":"#VALUE!"},{"$error":"#VALUE!"},"1+16,33628178i",{"$error":"#VALUE!"},null,{"$error":"#VALUE!"},null,{"$error":"#VALUE!"},{"$error":"#VALUE!"}]
[150000,150,"942477,795i","-888264394068,062","-837169467498278000i",null,{"$error":"#VALUE!"},null,{"$error":"#REF!"},{"$error":"#REF!"},null,{"$error":"#VALUE!"},{"$error":"#VALUE!"},{"$error":"#REF!"},{"$error":"#VALUE!"},4,"1+0,32986722825i","-0,0936457766343574i","-0,887909088310435","0,112090911689565+0,236221451615643i",1,1,0,0,null,"2,77938675294686-2,91445167327342i",12.100245900170394,-46.358872275853109,null,"18,8495559i","1+18,8495559i",{"$error":"#VALUE!"},{"$error":"#VALUE!"},"1+18,8495559i",{"$error":"#VALUE!"},null,{"$error":"#VALUE!"},null,{"$error":"#VALUE!"},{"$error":"#VALUE!"}]
[160000,160,"1005309,648i","-1010647488361,88","-1016013670777170000i",null,{"$error":"#VALUE!"},null,{"$error":"#REF!"},{"$error":"#REF!"},null,{"$error":"#VALUE!"},{"$error":"#VALUE!"},{"$error":"#REF!"},{"$error":"#VALUE!"},5,"1+0,3518583768i","-0,113651289213134i","-1,01024322936654","-0,01024322936654+0,238207087586866i",1,1,0,0,null,"1,29419724044521-4,25368014631354i",12.959790177872241,-73.077431398381563,null,"20,10619296i","1+20,10619296i",{"$error":"#VALUE!"},{"$error":"#VALUE!"},"1+20,10619296i",{"$error":"#VALUE!"},null,{"$error":"#VALUE!"},null,{"$error":"#VALUE!"},{"$error":"#VALUE!"}]
[175000,175,{"$f":"COMPLEX(0,2*Pi*A77)","v":"1099557,4275i"},{"$f":"COMPLEX(-POWER(2*Pi*A77,2),0)","v":"-1209026536370,42"},{"$f":"COMPLEX(0,-POWER(2*Pi*A77,3))","v":"-1329394108110690000i"},null,{"$error":"#VALUE!"},null,{"$f":"IMPRODUCT((RdampSel*CdampSel+RdampSel*CinjSel),C77)","v":{"$error":"#REF!"}},{"$error":"#REF!"},null,{"$f":"IMPRODUCT(G77,L_infilterStd*RdampSel*CinjSel*CdampSel,E77)","v":{"$error":"#VALUE!"}},{"$f":"IMPRODUCT(G77,L_infilterStd*CinjSel,D77)","v":{"$error":"#VALUE!"}},{"$error":"#REF!"},{"$error":"#VALUE!"},6,{"$f":"IMSUM(IMPRODUCT(C77,RdampPssv*CdampPssv),1)","v":"1+0,384845099625i"},{"$f":"IMPRODUCT(RdampPssv*CdampPssv*CfilterPssv*LinfilterPssv,E77)","v":"-0,148706024933262i"},{"$f":"IMPRODUCT(D77,LinfilterPssv*(CfilterPssv+CdampPssv))","v":"-1,20854292575587"},"-0,20854292575587+0,236139074691738i",1,1,0,0,null,{"$f":"IMDIV(Q77,T77)","v":"-1,18552956082797-3,18780870043445i"},10.632434371784214,{"$f":"IMARGUMENT(Z77)*180/Pi","v":-110.39990747553254},null,{"$f":"IMPRODUCT((RdampCom*CdampCom+RdampCom*CinjCom),C77)","v":"21,99114855i"},"1+21,99114855i",{"$f":"IMPRODUCT(G77,L_infilterStd*RdampSel*CinjSel*CdampSel,E77)","v":{"$error":"#VALUE!"}},{"$f":"IMPRODUCT(G77,LAEFCom*CinjCom,D77)","v":{"$error":"#VALUE!"}},"1+21,99114855i",{"$error":"#VALUE!"},null,{"$error":"#VALUE!"},null,{"$error":"#VALUE!"},{"$f":"IMARGUMENT(AK77)*180/Pi","v":{"$error":"#VALUE!"}}]
[190000,190,"1193805,207i","-1425170872260,31","-1701376408169090000i",null,{"$error":"#VALUE!"},null,{"$error":"#REF!"},{"$error":"#REF!"},null,{"$error":"#VALUE!"},{"$error":"#VALUE!"},{"$error":"#REF!"},{"$error":"#VALUE!"},7,"1+0,41783182245i","-0,190315965017794i","-1,42460080391141","-0,42460080391141+0,227515857432206i",1,1,0,0,null,"-1,42011816933091-1,74500664759685i",{"$f":"20*LOG10(IMABS(Z78))","v":7.0430359282769261},-129.13932379003126,null,"23,87610414i",{"$f":"IMSUM(1,AD78)","v":"1+23,87610414i"},{"$error":"#VALUE!"},{"$error":"#VALUE!"},{"$f":"AE78","v":"1+23,87610414i"},{"$f":"IMSUM(AF78:AH78)","v":{"$error":"#VALUE!"}},null,{"$f":"IMDIV(AE78,AI78)","v":{"$error":"#VALUE!"}},null,{"$f":"20*LOG10(IMABS(AK78))","v":{"$error":"#VALUE!"}},{"$error":"#VALUE!"}]
[200000,200,"1256637,06i","-1579136700565,44","-1984401700736660000i",null,{"$error":"#VALUE!"},null,{"$error":"#REF!"},{"$error":"#REF!"},null,{"$error":"#VALUE!"},{"$error":"#VALUE!"},{"$error":"#REF!"},{"$error":"#VALUE!"},0,"1+0,439822971i","-0,221975174244403i","-1,57850504588521","-0,57850504588521+0,217847796755597i",1,1,0,0,null,"-1,26317208366406-1,23594812428182i",4.9459582998103908,-135.6241223057485,null,"25,1327412i","1+25,1327412i",{"$error":"#VALUE!"},{"$error":"#VALUE!"},"1+25,1327412i",{"$error":"#VALUE!"},null,{"$error":"#VALUE!"},null,{"$error":"#VALUE!"},{"$error":"#VALUE!"}]
[300000,300,"1884955,59i","-3553057576272,25","-6697355739986230000i",null,{"$error":"#VALUE!"},null,{"$error":"#REF!"},{"$error":"#REF!"},null,{"$error":"#VALUE!"},{"$error":"#VALUE!"},{"$error":"#REF!"},{"$error":"#VALUE!"},0,"1+0,6597344565i","-0,74916621307486i","-3,55163635324174","-2,55163635324174-0,08943175657486i",1,1,0,0,null,"-0,400475408867723-0,244517302172491i",-6.5724330903943216,-148.59311414511541,null,"37,6991118i","1+37,6991118i",{"$error":"#VALUE!"},{"$error":"#VALUE!"},"1+37,6991118i",{"$error":"#VALUE!"},null,{"$error":"#VALUE!"},null,{"$error":"#VALUE!"},{"$error":"#VALUE!"}]
[400000,400,"2513274,12i","-6316546802261,78","-15875213605893300000i",null,{"$error":"#VALUE!"},null,{"$error":"#REF!"},{"$error":"#REF!"},null,{"$error":"#VALUE!"},{"$error":"#VALUE!"},{"$error":"#REF!"},{"$error":"#VALUE!"},0,"1+0,879645942i","-1,77580139395522i","-6,31402018354088","-5,31402018354088-0,89615545195522i",1,1,0,0,null,"-0,210121191022436-0,130098243366712i",-12.141260868793136,-148.23594278994108,null,"50,2654824i","1+50,2654824i",{"$error":"#VALUE!"},{"$error":"#VALUE!"},"1+50,2654824i",{"$error":"#VALUE!"},null,{"$error":"#VALUE!"},null,{"$error":"#VALUE!"},{"$error":"#VALUE!"}]
[500000,500,"3141592,65i","-9869604378534,03","-31006276574010300000i",null,{"$error":"#VALUE!"},null,{"$error":"#REF!"},{"$error":"#REF!"},null,{"$error":"#VALUE!"},{"$error":"#VALUE!"},{"$error":"#REF!"},{"$error":"#VALUE!"},0,"1+1,0995574275i","-3,46836209756879i","-9,86565653678262","-8,86565653678262-2,36880467006879i",1,1,0,0,null,"-0,136208802833546-0,0876308907321328i",-15.811684145573038,-147.2445124058745,null,"62,831853i","1+62,831853i",{"$error":"#VALUE!"},{"$error":"#VALUE!"},"1+62,831853i",{"$error":"#VALUE!"},null,{"$error":"#VALUE!"},null,{"$error":"#VALUE!"},{"$error":"#VALUE!"}]
[600000,600,"3769911,18i","-14212230305089","-53578845919889800000i",null,{"$f":"IMSUM(IMPRODUCT(C83,Rcomp_AEF*Csen_AEF),Csen_AEF/Ccomp_AEF)","v":{"$error":"#VALUE!"}},null,{"$error":"#REF!"},{"$error":"#REF!"},null,{"$error":"#VALUE!"},{"$error":"#VALUE!"},{"$error":"#REF!"},{"$error":"#VALUE!"},0,"1+1,319468913i","-5,99332970459887i","-14,206545412967","-13,206545412967-4,67386079159887i",1,{"$f":"CHOOSE(INFILTER_TYPE,U83,IMDIV(J83,O83),IMDIV(Q83,T83))","v":1},0,{"$f":"IMARGUMENT(V83)*180/Pi","v":0},null,"-0,0987148424567274-0,0649745603002369i",-18.549182102928064,-146.64690503853296,null,"75,3982236i","1+75,3982236i",{"$error":"#VALUE!"},{"$error":"#VALUE!"},"1+75,3982236i",{"$error":"#VALUE!"},null,{"$error":"#VALUE!"},null,{"$error":"#VALUE!"},{"$error":"#VALUE!"}]
[700000,700,"4398229,71i","-19344424581926,7","-85081222919084300000i",null,{"$error":"#VALUE!"},null,{"$error":"#REF!"},{"$error":"#REF!"},null,{"$error":"#VALUE!"},{"$error":"#VALUE!"},{"$error":"#REF!"},{"$error":"#VALUE!"},0,"1+1,5393803985i","-9,51718559572877i","-19,3366868120939","-18,3366868120939-7,97780519722877i",1,1,0,0,null,"-0,0765669830392885-0,050638587700621i",-20.743388875708668,-146.52081538204177,null,"87,9645942i","1+87,9645942i",{"$error":"#VALUE!"},{"$error":"#VALUE!"},"1+87,9645942i",{"$error":"#VALUE!"},null,{"$error":"#VALUE!"},null,{"$error":"#VALUE!"},{"$error":"#VALUE!"}]
[800000,800,"5026548,24i","-25266187209047,1","-127001708847146000000i",null,{"$error":"#VALUE!"},null,{"$error":"#REF!"},{"$error":"#REF!"},null,{"$error":"#VALUE!"},{"$error":"#VALUE!"},{"$error":"#REF!"},{"$error":"#VALUE!"},0,"1+1,759291884i","-14,2064111516417i","-25,2560807341635","-24,2560807341635-12,4471192676417i",1,1,0,0,null,"-0,0620946151681225-0,040665794855093i",-22.588919033913939,-146.77919071706401,null,"100,5309648i","1+100,5309648i",{"$error":"#VALUE!"},{"$error":"#VALUE!"},"1+100,5309648i",{"$error":"#VALUE!"},null,{"$error":"#VALUE!"},null,{"$error":"#VALUE!"},{"$error":"#VALUE!"}]
[900000,900,"5654866,77i","-31977518186450,2","-180828604979628000000i",null,{"$error":"#VALUE!"},null,{"$error":"#REF!"},{"$error":"#REF!"},null,{"$error":"#VALUE!"},{"$error":"#VALUE!"},{"$error":"#REF!"},{"$error":"#VALUE!"},0,"1+1,9792033695i","-20,2274877530212i","-31,9647271791756","-30,9647271791756-18,2482843835212i",1,1,0,0,null,"-0,0519283597315569-0,033315323192724i",-24.194781244722876,-147.31726418522518,null,"113,0973354i","1+113,0973354i",{"$error":"#VALUE!"},{"$error":"#VALUE!"},"1+113,0973354i",{"$error":"#VALUE!"},null,{"$error":"#VALUE!"},null,{"$error":"#VALUE!"},{"$error":"#VALUE!"}]
[1000000,1000,"6283185,3i","-39478417514136,1","-248050212592083000000i",null,{"$error":"#VALUE!"},null,{"$error":"#REF!"},{"$error":"#REF!"},null,{"$error":"#VALUE!"},{"$error":"#VALUE!"},{"$error":"#REF!"},{"$error":"#VALUE!"},0,"1+2,199114855i","-27,7468967805504i","-39,4626261471305","-38,4626261471305-25,5477819255504i",1,1,0,0,null,"-0,044391344457259-0,0276895930961649i",-25.626768047686518,-148.04569057314714,null,"125,663706i","1+125,663706i",{"$error":"#VALUE!"},{"$error":"#VALUE!"},"1+125,663706i",{"$error":"#VALUE!"},null,{"$error":"#VALUE!"},null,{"$error":"#VALUE!"},{"$error":"#VALUE!"}]
[2000000,2000,"12566370,6i","-157913670056544","-1,98440170073666E+21i",null,{"$error":"#VALUE!"},null,{"$error":"#REF!"},{"$error":"#REF!"},null,{"$error":"#VALUE!"},{"$error":"#VALUE!"},{"$error":"#REF!"},{"$error":"#VALUE!"},0,"1+4,39822971i","-221,975174244403i","-157,850504588521","-156,850504588521-217,576944534403i",1,1,0,0,null,"-0,0154820114155727-0,00656485596685991i",-35.485359346827785,-157.02154019060663,null,"251,327412i","1+251,327412i",{"$error":"#VALUE!"},{"$error":"#VALUE!"},"1+251,327412i",{"$error":"#VALUE!"},null,{"$error":"#VALUE!"},null,{"$error":"#VALUE!"},{"$error":"#VALUE!"}]
[3000000,3000,"18849555,9i","-355305757627225","-6,69735573998623E+21i",null,{"$error":"#VALUE!"},null,{"$error":"#REF!"},{"$error":"#REF!"},null,{"$error":"#VALUE!"},{"$error":"#VALUE!"},{"$error":"#REF!"},{"$error":"#VALUE!"},0,"1+6,597344565i","-749,16621307486i","-355,163635324174","-354,163635324174-742,56886850986i",1,1,0,0,null,"-0,00776127767315144-0,00235501700871593i",-41.818827844809874,-163.12054420169724,null,"376,991118i","1+376,991118i",{"$error":"#VALUE!"},{"$error":"#VALUE!"},"1+376,991118i",{"$error":"#VALUE!"},null,{"$error":"#VALUE!"},null,{"$error":"#VALUE!"},{"$error":"#VALUE!"}]
[4000000,4000,"25132741,2i","-631654680226178","-1,58752136058933E+22i",null,{"$error":"#VALUE!"},null,{"$error":"#REF!"},{"$error":"#REF!"},null,{"$error":"#VALUE!"},{"$error":"#VALUE!"},{"$error":"#REF!"},{"$error":"#VALUE!"},0,"1+8,79645942i","-1775,80139395522i","-631,402018354088","-630,402018354088-1767,00493453522i",1,1,0,0,null,"-0,00459520096124435-0,00107346840047734i",-46.523147642689807,-166.85114049434898,null,"502,654824i","1+502,654824i",{"$error":"#VALUE!"},{"$error":"#VALUE!"},"1+502,654824i",{"$error":"#VALUE!"},null,{"$error":"#VALUE!"},null,{"$error":"#VALUE!"},{"$error":"#VALUE!"}]
[5000000,5000,"31415926,5i","-986960437853403","-3,10062765740103E+22i",null,{"$error":"#VALUE!"},null,{"$error":"#REF!"},{"$error":"#REF!"},null,{"$error":"#VALUE!"},{"$error":"#VALUE!"},{"$error":"#REF!"},{"$error":"#VALUE!"},0,"1+10,995574275i","-3468,36209756879i","-986,565653678262","-985,565653678262-3457,36652329379i",1,1,0,0,null,"-0,00301757308495533-0,000570959537178404i",-50.254080822840123,-169.28564289756036,null,"628,31853i","1+628,31853i",{"$error":"#VALUE!"},{"$error":"#VALUE!"},"1+628,31853i",{"$error":"#VALUE!"},null,{"$error":"#VALUE!"},null,{"$error":"#VALUE!"},{"$error":"#VALUE!"}]
[6000000,6000,"37699111,8i","-1421223030508900","-5,35788459198898E+22i",null,{"$error":"#VALUE!"},null,{"$error":"#REF!"},{"$error":"#REF!"},null,{"$error":"#VALUE!"},{"$error":"#VALUE!"},{"$error":"#REF!"},{"$error":"#VALUE!"},0,"1+13,19468913i","-5993,32970459887i","-1420,6545412967","-1419,6545412967-5980,13501546887i",1,1,0,0,null,"-0,00212628728062533-0,000337549802608077i",-53.339467507298949,-170.979524286046,null,"753,982236i","1+753,982236i",{"$error":"#VALUE!"},{"$error":"#VALUE!"},"1+753,982236i",{"$error":"#VALUE!"},null,{"$error":"#VALUE!"},null,{"$error":"#VALUE!"},{"$error":"#VALUE!"}]
[7000000,7000,"43982297,1i","-1934442458192670","-8,50812229190843E+22i",null,{"$error":"#VALUE!"},null,{"$error":"#REF!"},{"$error":"#REF!"},null,{"$error":"#VALUE!"},{"$error":"#VALUE!"},{"$error":"#REF!"},{"$error":"#VALUE!"},0,"1+15,393803985i","-9517,18559572877i","-1933,66868120939","-1932,66868120939-9501,79179174377i",1,1,0,0,null,"-0,00157628762603077-0,000215374297002146i",-55.966960551322785,-172.21963347996476,null,"879,645942i","1+879,645942i",{"$error":"#VALUE!"},{"$error":"#VALUE!"},"1+879,645942i",{"$error":"#VALUE!"},null,{"$error":"#VALUE!"},null,{"$error":"#VALUE!"},{"$error":"#VALUE!"}]
[8000000,8000,"50265482,4i","-2526618720904710","-1,27001708847146E+23i",null,{"$error":"#VALUE!"},null,{"$error":"#REF!"},{"$error":"#REF!"},null,{"$error":"#VALUE!"},{"$error":"#VALUE!"},{"$error":"#REF!"},{"$error":"#VALUE!"},0,"1+17,59291884i","-14206,4111516417i","-2525,60807341635","-2524,60807341635-14188,8182328017i",1,1,0,0,null,"-0,00121401992445827-0,000145531817287078i",-58.253518683206799,-173.1642323462458,null,"1005,309648i","1+1005,309648i",{"$error":"#VALUE!"},{"$error":"#VALUE!"},"1+1005,309648i",{"$error":"#VALUE!"},null,{"$error":"#VALUE!"},null,{"$error":"#VALUE!"},{"$error":"#VALUE!"}]
[9000000,9000,"56548667,7i","-3197751818645020","-1,80828604979628E+23i",null,{"$error":"#VALUE!"},null,{"$error":"#REF!"},{"$error":"#REF!"},null,{"$error":"#VALUE!"},{"$error":"#VALUE!"},{"$error":"#REF!"},{"$error":"#VALUE!"},0,"1+19,792033695i","-20227,4877530212i","-3196,47271791756","-3195,47271791756-20207,6957193262i",1,1,0,0,null,"-0,000963171180292813-0,000102821581350465i",-60.27671706539698,-173.90657129969617,null,"1130,973354i","1+1130,973354i",{"$error":"#VALUE!"},{"$error":"#VALUE!"},"1+1130,973354i",{"$error":"#VALUE!"},null,{"$error":"#VALUE!"},null,{"$error":"#VALUE!"},{"$error":"#VALUE!"}]
[10000000,10000,"62831853i","-3947841751413610","-2,48050212592082E+23i",null,{"$error":"#VALUE!"},null,{"$error":"#REF!"},{"$error":"#REF!"},null,{"$error":"#VALUE!"},{"$error":"#VALUE!"},{"$error":"#REF!"},{"$error":"#VALUE!"},0,"1+21,99114855i","-27746,8967805503i","-3946,26261471304","-3945,26261471304-27724,9056320003i",1,1,0,0,null,"-0,000782478973720499-0,0000752783461022707i",-62.09053569388221,-174.50477476720093,null,"1256,63706i","1+1256,63706i",{"$error":"#VALUE!"},{"$error":"#VALUE!"},"1+1256,63706i",{"$error":"#VALUE!"},null,{"$error":"#VALUE!"},null,{"$error":"#VALUE!"},{"$error":"#VALUE!"}]
[{"$f":"Fsw","v":425000},{"$f":"A97/1000","v":425},"2670353,7525i","-7130789163490,83","-19041729601014100000i",null,{"$error":"#VALUE!"},null,{"$error":"#REF!"},{"$f":"IMSUM(1,I97)","v":{"$error":"#REF!"}},null,{"$error":"#VALUE!"},{"$error":"#VALUE!"},{"$f":"J97","v":{"$error":"#REF!"}},{"$f":"IMSUM(L97:N97)","v":{"$error":"#VALUE!"}},2,"1+0,934623813375i","-2,13000787316944i","-7,12793684782543",{"$f":"IMSUM(S97,R97,Q97)","v":"-6,12793684782543-1,19538405979444i"},1,1,{"$f":"20*LOG10(IMABS(V97))","v":0},0,null,"-0,185866302226031-0,116261348008814i",-13.181892753626096,-147.97358304191607,null,"53,40707505i","1+53,40707505i",{"$error":"#VALUE!"},{"$error":"#VALUE!"},"1+53,40707505i",{"$error":"#VALUE!"},null,{"$error":"#VALUE!"},null,{"$error":"#VALUE!"},{"$error":"#VALUE!"}]

{"sheet":"Standard Value Calculator","index":12,"n_rows":159,"n_cols":20,"rows_kept":159,"cut":false,"hidden":true,"merged":[]}
[]
["Capacitors","Css","Cc1ea","Cc2ea","Cout","Cin","Cres","Cdither","Cc3ea","Cc4ea","Cin_Passive","Cdamp_Pssv","Cinj_AEF","Cdamp_AEF"]
["Inputs",{"$f":"Css","v":0},{"$f":"Cc1ea","v":1.6829014242523066E-9},{"$f":"Cc2ea","v":2.4158045073763862E-10},{"$f":"Cout","v":6.0000000000000002E-5},{"$f":"Cin","v":1.2E-4},{"$f":"Cres","v":1.8333333333333336E-7},{"$f":"Cdither_init","v":{"$error":"#VALUE!"}},{"$f":"Cc3ea","v":0},{"$f":"Cc4ea","v":0},{"$f":"'Variable Management'!B292*0.000001","v":{"$error":"#VALUE!"}},{"$f":"K3*4","v":{"$error":"#VALUE!"}},{"$f":"Cinj_AEF*0.000001","v":{"$error":"#VALUE!"}},{"$f":"'Variable Management'!B295*0.000001","v":{"$error":"#VALUE!"}},null,null,"Resistors","inputs","Standard Result"]
["Standard Result",{"$f":"SUM(B6:B158)/1000000000000","v":0},{"$f":"IF(C3=\"OPEN\",\"OPEN\",SUM(C6:C158)/1000000000000)","v":1.8E-9},{"$f":"SUM(D6:D158)/1000000000000","v":2.1999999999999999E-10},{"$f":"SUM(E6:E158)/1000000000000","v":5.5999999999999999E-5},{"$f":"SUM(F6:F158)/1000000000000","v":1.2E-4},{"$f":"SUM(G6:G158)/1000000000000","v":1.8E-7},{"$f":"IF(H3=\"OPEN\",\"OPEN\",SUM(H6:H158)/1000000000000)","v":{"$error":"#VALUE!"}},0,0,{"$error":"#VALUE!"},{"$error":"#VALUE!"},{"$error":"#VALUE!"},{"$error":"#VALUE!"},null,null,"Rt",{"$f":"Rfadj","v":51.1},{"$f":"IF(R4>(INT(0.5+100*POWER(10,IF(96*(LOG(R4)-INT(LOG(R4)))-ROUND(96*(LOG(R4)-INT(LOG(R4))),0)<0,ROUND(96*(LOG(R4)-INT(LOG(R4))),0)-1,ROUND(96*(LOG(R4)-INT(LOG(R4))),0))/96))*POWER(10,INT(LOG(R4))-2)+INT(0.5+100*POWER(10,(IF(96*(LOG(R4)-INT(LOG(R4)))-ROUND(96*(LOG(R4)-INT(LOG(R4))),0)<0,ROUND(96*(LOG(R4)-INT(LOG(R4))),0)-1,ROUND(96*(LOG(R4)-INT(LOG(R4))),0))+1)/96))*POWER(10,INT(LOG(R4))-2))/2,INT(0.5+100*POWER(10,(IF(96*(LOG(R4)-INT(LOG(R4)))-ROUND(96*(LOG(R4)-INT(LOG(R4))),0)<0,ROUND(96*(LOG(R4)-INT(LOG(R4))),0)-1,ROUND(96*(LOG(R4)-INT(LOG(R4))),0))+1)/96))*POWER(10,INT(LOG(R4))-2),INT(0.5+100*POWER(10,IF(96*(LOG(R4)-INT(LOG(R4)))-ROUND(96*(LOG(R4)-INT(LOG(R4))),0)<0,ROUND(96*(LOG(R4)-INT(LOG(R4))),0)-1,ROUND(96*(LOG(R4)-INT(LOG(R4))),0))/96))*POWER(10,INT(LOG(R4))-2))","v":51.1},"Ω"]
["(pF)"]
[0.47,{"$f":"IF(IF((B$3*10^12-$A7)*(B$3*10^12-$A6)*-1<0,0,1)*IF(ABS(B$3*10^12-$A7)>(B$3*10^12-$A6),$A6,$A7)=B7,0,IF((B$3*10^12-$A7)*(B$3*10^12-$A6)*-1<0,0,1)*IF(ABS(B$3*10^12-$A7)>(B$3*10^12-$A6),$A6,$A7))","v":0},0,0,0,0,0,{"$error":"#VALUE!"},0,0,{"$error":"#VALUE!"},{"$error":"#VALUE!"},{"$error":"#VALUE!"},{"$error":"#VALUE!"}]
[0.56000000000000005,{"$f":"IF(IF((B$3*10^12-$A8)*(B$3*10^12-$A7)*-1<0,0,1)*IF(ABS(B$3*10^12-$A8)>(B$3*10^12-$A7),$A7,$A8)=B8,0,IF((B$3*10^12-$A8)*(B$3*10^12-$A7)*-1<0,0,1)*IF(ABS(B$3*10^12-$A8)>(B$3*10^12-$A7),$A7,$A8))","v":0},{"$f":"IF(IF((C$3*10^12-$A8)*(C$3*10^12-$A7)*-1<0,0,1)*IF(ABS(C$3*10^12-$A8)>(C$3*10^12-$A7),$A7,$A8)=C8,0,IF((C$3*10^12-$A8)*(C$3*10^12-$A7)*-1<0,0,1)*IF(ABS(C$3*10^12-$A8)>(C$3*10^12-$A7),$A7,$A8))","v":0},{"$f":"IF(IF((D$3*10^12-$A8)*(D$3*10^12-$A7)*-1<0,0,1)*IF(ABS(D$3*10^12-$A8)>(D$3*10^12-$A7),$A7,$A8)=D8,0,IF((D$3*10^12-$A8)*(D$3*10^12-$A7)*-1<0,0,1)*IF(ABS(D$3*10^12-$A8)>(D$3*10^12-$A7),$A7,$A8))","v":0},{"$f":"IF(IF((E$3*10^12-$A8)*(E$3*10^12-$A7)*-1<0,0,1)*IF(ABS(E$3*10^12-$A8)>(E$3*10^12-$A7),$A7,$A8)=E8,0,IF((E$3*10^12-$A8)*(E$3*10^12-$A7)*-1<0,0,1)*IF(ABS(E$3*10^12-$A8)>(E$3*10^12-$A7),$A7,$A8))","v":0},{"$f":"IF(IF((F$3*10^12-$A8)*(F$3*10^12-$A7)*-1<0,0,1)*IF(ABS(F$3*10^12-$A8)>(F$3*10^12-$A7),$A7,$A8)=F8,0,IF((F$3*10^12-$A8)*(F$3*10^12-$A7)*-1<0,0,1)*IF(ABS(F$3*10^12-$A8)>(F$3*10^12-$A7),$A7,$A8))","v":0},{"$f":"IF(IF((G$3*10^12-$A8)*(G$3*10^12-$A7)*-1<0,0,1)*IF(ABS(G$3*10^12-$A8)>(G$3*10^12-$A7),$A7,$A8)=G8,0,IF((G$3*10^12-$A8)*(G$3*10^12-$A7)*-1<0,0,1)*IF(ABS(G$3*10^12-$A8)>(G$3*10^12-$A7),$A7,$A8))","v":0},{"$error":"#VALUE!"},0,0,{"$f":"IF(IF((K$3*10^12-$A8)*(K$3*10^12-$A7)*-1<0,0,1)*IF(ABS(K$3*10^12-$A8)>(K$3*10^12-$A7),$A7,$A8)=K8,0,IF((K$3*10^12-$A8)*(K$3*10^12-$A7)*-1<0,0,1)*IF(ABS(K$3*10^12-$A8)>(K$3*10^12-$A7),$A7,$A8))","v":{"$error":"#VALUE!"}},{"$error":"#VALUE!"},{"$error":"#VALUE!"},{"$error":"#VALUE!"},null,null,"Rc1ea",{"$f":"Rcea1","v":14549.500960312502},{"$f":"IF(R7>(INT(0.5+100*POWER(10,IF(96*(LOG(R7)-INT(LOG(R7)))-ROUND(96*(LOG(R7)-INT(LOG(R7))),0)<0,ROUND(96*(LOG(R7)-INT(LOG(R7))),0)-1,ROUND(96*(LOG(R7)-INT(LOG(R7))),0))/96))*POWER(10,INT(LOG(R7))-2)+INT(0.5+100*POWER(10,(IF(96*(LOG(R7)-INT(LOG(R7)))-ROUND(96*(LOG(R7)-INT(LOG(R7))),0)<0,ROUND(96*(LOG(R7)-INT(LOG(R7))),0)-1,ROUND(96*(LOG(R7)-INT(LOG(R7))),0))+1)/96))*POWER(10,INT(LOG(R7))-2))/2,INT(0.5+100*POWER(10,(IF(96*(LOG(R7)-INT(LOG(R7)))-ROUND(96*(LOG(R7)-INT(LOG(R7))),0)<0,ROUND(96*(LOG(R7)-INT(LOG(R7))),0)-1,ROUND(96*(LOG(R7)-INT(LOG(R7))),0))+1)/96))*POWER(10,INT(LOG(R7))-2),INT(0.5+100*POWER(10,IF(96*(LOG(R7)-INT(LOG(R7)))-ROUND(96*(LOG(R7)-INT(LOG(R7))),0)<0,ROUND(96*(LOG(R7)-INT(LOG(R7))),0)-1,ROUND(96*(LOG(R7)-INT(LOG(R7))),0))/96))*POWER(10,INT(LOG(R7))-2))","v":14700},"Ω"]
[0.68,0,0,0,0,0,0,{"$error":"#VALUE!"},0,0,{"$error":"#VALUE!"},{"$error":"#VALUE!"},{"$error":"#VALUE!"},{"$error":"#VALUE!"},null,null,"Rc1ea",{"$f":"Rcea2","v":0},{"$f":"IF(R8>(INT(0.5+100*POWER(10,IF(96*(LOG(R8)-INT(LOG(R8)))-ROUND(96*(LOG(R8)-INT(LOG(R8))),0)<0,ROUND(96*(LOG(R8)-INT(LOG(R8))),0)-1,ROUND(96*(LOG(R8)-INT(LOG(R8))),0))/96))*POWER(10,INT(LOG(R8))-2)+INT(0.5+100*POWER(10,(IF(96*(LOG(R8)-INT(LOG(R8)))-ROUND(96*(LOG(R8)-INT(LOG(R8))),0)<0,ROUND(96*(LOG(R8)-INT(LOG(R8))),0)-1,ROUND(96*(LOG(R8)-INT(LOG(R8))),0))+1)/96))*POWER(10,INT(LOG(R8))-2))/2,INT(0.5+100*POWER(10,(IF(96*(LOG(R8)-INT(LOG(R8)))-ROUND(96*(LOG(R8)-INT(LOG(R8))),0)<0,ROUND(96*(LOG(R8)-INT(LOG(R8))),0)-1,ROUND(96*(LOG(R8)-INT(LOG(R8))),0))+1)/96))*POWER(10,INT(LOG(R8))-2),INT(0.5+100*POWER(10,IF(96*(LOG(R8)-INT(LOG(R8)))-ROUND(96*(LOG(R8)-INT(LOG(R8))),0)<0,ROUND(96*(LOG(R8)-INT(LOG(R8))),0)-1,ROUND(96*(LOG(R8)-INT(LOG(R8))),0))/96))*POWER(10,INT(LOG(R8))-2))","v":{"$error":"#NUM!"}},"Ω"]
[0.82,0,0,0,0,0,0,{"$error":"#VALUE!"},0,0,{"$error":"#VALUE!"},{"$error":"#VALUE!"},{"$error":"#VALUE!"},{"$error":"#VALUE!"}]
[1,0,0,0,0,0,0,{"$error":"#VALUE!"},0,0,{"$error":"#VALUE!"},{"$error":"#VALUE!"},{"$error":"#VALUE!"},{"$error":"#VALUE!"},null,null,"Rfb1",{"$f":"Rfb1_","v":287000},{"$f":"IF(R10>(INT(0.5+100*POWER(10,IF(96*(LOG(R10)-INT(LOG(R10)))-ROUND(96*(LOG(R10)-INT(LOG(R10))),0)<0,ROUND(96*(LOG(R10)-INT(LOG(R10))),0)-1,ROUND(96*(LOG(R10)-INT(LOG(R10))),0))/96))*POWER(10,INT(LOG(R10))-2)+INT(0.5+100*POWER(10,(IF(96*(LOG(R10)-INT(LOG(R10)))-ROUND(96*(LOG(R10)-INT(LOG(R10))),0)<0,ROUND(96*(LOG(R10)-INT(LOG(R10))),0)-1,ROUND(96*(LOG(R10)-INT(LOG(R10))),0))+1)/96))*POWER(10,INT(LOG(R10))-2))/2,INT(0.5+100*POWER(10,(IF(96*(LOG(R10)-INT(LOG(R10)))-ROUND(96*(LOG(R10)-INT(LOG(R10))),0)<0,ROUND(96*(LOG(R10)-INT(LOG(R10))),0)-1,ROUND(96*(LOG(R10)-INT(LOG(R10))),0))+1)/96))*POWER(10,INT(LOG(R10))-2),INT(0.5+100*POWER(10,IF(96*(LOG(R10)-INT(LOG(R10)))-ROUND(96*(LOG(R10)-INT(LOG(R10))),0)<0,ROUND(96*(LOG(R10)-INT(LOG(R10))),0)-1,ROUND(96*(LOG(R10)-INT(LOG(R10))),0))/96))*POWER(10,INT(LOG(R10))-2))","v":287000},"Ω"]
[1.2,0,0,0,0,0,0,{"$error":"#VALUE!"},0,0,{"$error":"#VALUE!"},{"$error":"#VALUE!"},{"$f":"IF(IF((M$3*10^12-$A12)*(M$3*10^12-$A11)*-1<0,0,1)*IF(ABS(M$3*10^12-$A12)>(M$3*10^12-$A11),$A11,$A12)=M12,0,IF((M$3*10^12-$A12)*(M$3*10^12-$A11)*-1<0,0,1)*IF(ABS(M$3*10^12-$A12)>(M$3*10^12-$A11),$A11,$A12))","v":{"$error":"#VALUE!"}},{"$error":"#VALUE!"},null,null,"Rfb2",{"$f":"Rfb2_","v":12615.384615384615},{"$f":"IF(R11=\"OPEN\",\"OPEN\",IF(R11>(INT(0.5+100*POWER(10,IF(96*(LOG(R11)-INT(LOG(R11)))-ROUND(96*(LOG(R11)-INT(LOG(R11))),0)<0,ROUND(96*(LOG(R11)-INT(LOG(R11))),0)-1,ROUND(96*(LOG(R11)-INT(LOG(R11))),0))/96))*POWER(10,INT(LOG(R11))-2)+INT(0.5+100*POWER(10,(IF(96*(LOG(R11)-INT(LOG(R11)))-ROUND(96*(LOG(R11)-INT(LOG(R11))),0)<0,ROUND(96*(LOG(R11)-INT(LOG(R11))),0)-1,ROUND(96*(LOG(R11)-INT(LOG(R11))),0))+1)/96))*POWER(10,INT(LOG(R11))-2))/2,INT(0.5+100*POWER(10,(IF(96*(LOG(R11)-INT(LOG(R11)))-ROUND(96*(LOG(R11)-INT(LOG(R11))),0)<0,ROUND(96*(LOG(R11)-INT(LOG(R11))),0)-1,ROUND(96*(LOG(R11)-INT(LOG(R11))),0))+1)/96))*POWER(10,INT(LOG(R11))-2),INT(0.5+100*POWER(10,IF(96*(LOG(R11)-INT(LOG(R11)))-ROUND(96*(LOG(R11)-INT(LOG(R11))),0)<0,ROUND(96*(LOG(R11)-INT(LOG(R11))),0)-1,ROUND(96*(LOG(R11)-INT(LOG(R11))),0))/96))*POWER(10,INT(LOG(R11))-2)))","v":12700},"Ω"]
[1.5,0,0,0,0,0,0,{"$error":"#VALUE!"},0,0,{"$error":"#VALUE!"},{"$error":"#VALUE!"},{"$error":"#VALUE!"},{"$error":"#VALUE!"},null,null,"Rt1",{"$f":"'Variable Management'!B27*1000","v":51209.803921568629},{"$f":"IF(R12>(INT(0.5+100*POWER(10,IF(96*(LOG(R12)-INT(LOG(R12)))-ROUND(96*(LOG(R12)-INT(LOG(R12))),0)<0,ROUND(96*(LOG(R12)-INT(LOG(R12))),0)-1,ROUND(96*(LOG(R12)-INT(LOG(R12))),0))/96))*POWER(10,INT(LOG(R12))-2)+INT(0.5+100*POWER(10,(IF(96*(LOG(R12)-INT(LOG(R12)))-ROUND(96*(LOG(R12)-INT(LOG(R12))),0)<0,ROUND(96*(LOG(R12)-INT(LOG(R12))),0)-1,ROUND(96*(LOG(R12)-INT(LOG(R12))),0))+1)/96))*POWER(10,INT(LOG(R12))-2))/2,INT(0.5+100*POWER(10,(IF(96*(LOG(R12)-INT(LOG(R12)))-ROUND(96*(LOG(R12)-INT(LOG(R12))),0)<0,ROUND(96*(LOG(R12)-INT(LOG(R12))),0)-1,ROUND(96*(LOG(R12)-INT(LOG(R12))),0))+1)/96))*POWER(10,INT(LOG(R12))-2),INT(0.5+100*POWER(10,IF(96*(LOG(R12)-INT(LOG(R12)))-ROUND(96*(LOG(R12)-INT(LOG(R12))),0)<0,ROUND(96*(LOG(R12)-INT(LOG(R12))),0)-1,ROUND(96*(LOG(R12)-INT(LOG(R12))),0))/96))*POWER(10,INT(LOG(R12))-2))","v":51100},"Ω"]
[1.8,0,0,0,0,0,0,{"$error":"#VALUE!"},0,0,{"$error":"#VALUE!"},{"$error":"#VALUE!"},{"$error":"#VALUE!"},{"$error":"#VALUE!"},null,null,"Rd",{"$f":"'Variable Management'!B28*1000","v":0},{"$f":"IF(R13=\"OPEN\",\"OPEN\",IF(R13>(INT(0.5+100*POWER(10,IF(96*(LOG(R13)-INT(LOG(R13)))-ROUND(96*(LOG(R13)-INT(LOG(R13))),0)<0,ROUND(96*(LOG(R13)-INT(LOG(R13))),0)-1,ROUND(96*(LOG(R13)-INT(LOG(R13))),0))/96))*POWER(10,INT(LOG(R13))-2)+INT(0.5+100*POWER(10,(IF(96*(LOG(R13)-INT(LOG(R13)))-ROUND(96*(LOG(R13)-INT(LOG(R13))),0)<0,ROUND(96*(LOG(R13)-INT(LOG(R13))),0)-1,ROUND(96*(LOG(R13)-INT(LOG(R13))),0))+1)/96))*POWER(10,INT(LOG(R13))-2))/2,INT(0.5+100*POWER(10,(IF(96*(LOG(R13)-INT(LOG(R13)))-ROUND(96*(LOG(R13)-INT(LOG(R13))),0)<0,ROUND(96*(LOG(R13)-INT(LOG(R13))),0)-1,ROUND(96*(LOG(R13)-INT(LOG(R13))),0))+1)/96))*POWER(10,INT(LOG(R13))-2),INT(0.5+100*POWER(10,IF(96*(LOG(R13)-INT(LOG(R13)))-ROUND(96*(LOG(R13)-INT(LOG(R13))),0)<0,ROUND(96*(LOG(R13)-INT(LOG(R13))),0)-1,ROUND(96*(LOG(R13)-INT(LOG(R13))),0))/96))*POWER(10,INT(LOG(R13))-2)))","v":{"$error":"#NUM!"}},"Ω"]
[2.2000000000000002,{"$f":"IF(IF((B$3*10^12-$A15)*(B$3*10^12-$A14)*-1<0,0,1)*IF(ABS(B$3*10^12-$A15)>(B$3*10^12-$A14),$A14,$A15)=B15,0,IF((B$3*10^12-$A15)*(B$3*10^12-$A14)*-1<0,0,1)*IF(ABS(B$3*10^12-$A15)>(B$3*10^12-$A14),$A14,$A15))","v":0},0,0,0,0,0,{"$error":"#VALUE!"},0,0,{"$error":"#VALUE!"},{"$error":"#VALUE!"},{"$error":"#VALUE!"},{"$error":"#VALUE!"},null,null,"Rd_AEF",{"$f":"'Variable Management'!B301","v":7.5277265270908097E-2},{"$f":"IF(R14=\"OPEN\",\"OPEN\",IF(R14>(INT(0.5+100*POWER(10,IF(96*(LOG(R14)-INT(LOG(R14)))-ROUND(96*(LOG(R14)-INT(LOG(R14))),0)<0,ROUND(96*(LOG(R14)-INT(LOG(R14))),0)-1,ROUND(96*(LOG(R14)-INT(LOG(R14))),0))/96))*POWER(10,INT(LOG(R14))-2)+INT(0.5+100*POWER(10,(IF(96*(LOG(R14)-INT(LOG(R14)))-ROUND(96*(LOG(R14)-INT(LOG(R14))),0)<0,ROUND(96*(LOG(R14)-INT(LOG(R14))),0)-1,ROUND(96*(LOG(R14)-INT(LOG(R14))),0))+1)/96))*POWER(10,INT(LOG(R14))-2))/2,INT(0.5+100*POWER(10,(IF(96*(LOG(R14)-INT(LOG(R14)))-ROUND(96*(LOG(R14)-INT(LOG(R14))),0)<0,ROUND(96*(LOG(R14)-INT(LOG(R14))),0)-1,ROUND(96*(LOG(R14)-INT(LOG(R14))),0))+1)/96))*POWER(10,INT(LOG(R14))-2),INT(0.5+100*POWER(10,IF(96*(LOG(R14)-INT(LOG(R14)))-ROUND(96*(LOG(R14)-INT(LOG(R14))),0)<0,ROUND(96*(LOG(R14)-INT(LOG(R14))),0)-1,ROUND(96*(LOG(R14)-INT(LOG(R14))),0))/96))*POWER(10,INT(LOG(R14))-2)))","v":7.4999999999999997E-2},"Ω"]
[2.7,0,0,0,0,0,0,{"$error":"#VALUE!"},0,0,{"$f":"IF(IF((K$3*10^12-$A16)*(K$3*10^12-$A15)*-1<0,0,1)*IF(ABS(K$3*10^12-$A16)>(K$3*10^12-$A15),$A15,$A16)=K16,0,IF((K$3*10^12-$A16)*(K$3*10^12-$A15)*-1<0,0,1)*IF(ABS(K$3*10^12-$A16)>(K$3*10^12-$A15),$A15,$A16))","v":{"$error":"#VALUE!"}},{"$error":"#VALUE!"},{"$error":"#VALUE!"},{"$error":"#VALUE!"}]
[3.3,0,0,0,0,0,0,{"$error":"#VALUE!"},0,0,{"$error":"#VALUE!"},{"$error":"#VALUE!"},{"$error":"#VALUE!"},{"$error":"#VALUE!"},null,null,"Rs",{"$f":"Rs_ideal*1000","v":3.1258523807682499},{"$f":"IF(R16=0,0,IF(R16>(INT(0.5+100*POWER(10,IF(96*(LOG(R16)-INT(LOG(R16)))-ROUND(96*(LOG(R16)-INT(LOG(R16))),0)<0,ROUND(96*(LOG(R16)-INT(LOG(R16))),0)-1,ROUND(96*(LOG(R16)-INT(LOG(R16))),0))/96))*POWER(10,INT(LOG(R16))-2)+INT(0.5+100*POWER(10,(IF(96*(LOG(R16)-INT(LOG(R16)))-ROUND(96*(LOG(R16)-INT(LOG(R16))),0)<0,ROUND(96*(LOG(R16)-INT(LOG(R16))),0)-1,ROUND(96*(LOG(R16)-INT(LOG(R16))),0))+1)/96))*POWER(10,INT(LOG(R16))-2))/2,INT(0.5+100*POWER(10,(IF(96*(LOG(R16)-INT(LOG(R16)))-ROUND(96*(LOG(R16)-INT(LOG(R16))),0)<0,ROUND(96*(LOG(R16)-INT(LOG(R16))),0)-1,ROUND(96*(LOG(R16)-INT(LOG(R16))),0))+1)/96))*POWER(10,INT(LOG(R16))-2),INT(0.5+100*POWER(10,IF(96*(LOG(R16)-INT(LOG(R16)))-ROUND(96*(LOG(R16)-INT(LOG(R16))),0)<0,ROUND(96*(LOG(R16)-INT(LOG(R16))),0)-1,ROUND(96*(LOG(R16)-INT(LOG(R16))),0))/96))*POWER(10,INT(LOG(R16))-2)))","v":3.16},"mΩ"]
[3.9,0,0,0,0,0,0,{"$error":"#VALUE!"},0,0,{"$error":"#VALUE!"},{"$error":"#VALUE!"},{"$error":"#VALUE!"},{"$error":"#VALUE!"},null,null,"Cres",{"$f":"Cres","v":1.8333333333333336E-7},{"$f":"G4*1000000000000","v":180000},"pF"]
[4.7,0,0,0,0,0,0,{"$error":"#VALUE!"},0,0,{"$error":"#VALUE!"},{"$error":"#VALUE!"},{"$error":"#VALUE!"},{"$error":"#VALUE!"}]
[5.6,0,0,0,0,0,0,{"$error":"#VALUE!"},0,0,{"$error":"#VALUE!"},{"$error":"#VALUE!"},{"$error":"#VALUE!"},{"$error":"#VALUE!"}]
[6.8,0,0,0,0,0,0,{"$error":"#VALUE!"},0,0,{"$error":"#VALUE!"},{"$error":"#VALUE!"},{"$error":"#VALUE!"},{"$error":"#VALUE!"}]
[8.1999999999999993,0,0,0,0,0,0,{"$error":"#VALUE!"},0,0,{"$error":"#VALUE!"},{"$error":"#VALUE!"},{"$error":"#VALUE!"},{"$error":"#VALUE!"},null,null,"Cdither",{"$f":"Cdither_init","v":{"$error":"#VALUE!"}},{"$f":"H4","v":{"$error":"#VALUE!"}}]
[10,0,0,0,0,0,0,{"$error":"#VALUE!"},0,0,{"$f":"IF(IF((K$3*10^12-$A23)*(K$3*10^12-$A22)*-1<0,0,1)*IF(ABS(K$3*10^12-$A23)>(K$3*10^12-$A22),$A22,$A23)=K23,0,IF((K$3*10^12-$A23)*(K$3*10^12-$A22)*-1<0,0,1)*IF(ABS(K$3*10^12-$A23)>(K$3*10^12-$A22),$A22,$A23))","v":{"$error":"#VALUE!"}},{"$error":"#VALUE!"},{"$error":"#VALUE!"},{"$error":"#VALUE!"}]
[12,0,0,0,0,0,0,{"$error":"#VALUE!"},0,0,{"$error":"#VALUE!"},{"$error":"#VALUE!"},{"$error":"#VALUE!"},{"$error":"#VALUE!"},null,null,"Cin_Passive",{"$f":"K4","v":{"$error":"#VALUE!"}},{"$f":"R23*1000000","v":{"$error":"#VALUE!"}},"uF"]
[15,0,0,0,0,0,0,{"$error":"#VALUE!"},0,0,{"$error":"#VALUE!"},{"$error":"#VALUE!"},{"$error":"#VALUE!"},{"$error":"#VALUE!"},null,null,"Cinj_AEF",{"$f":"Cinj_AEF","v":{"$error":"#VALUE!"}},{"$f":"M4*1000000","v":{"$error":"#VALUE!"}},"uF"]
[18,0,0,0,0,0,0,{"$error":"#VALUE!"},0,0,{"$error":"#VALUE!"},{"$error":"#VALUE!"},{"$error":"#VALUE!"},{"$error":"#VALUE!"},null,null,"Cdamp_AEF",{"$f":"'Variable Management'!B295","v":{"$error":"#VALUE!"}},{"$f":"N4*1000000","v":{"$error":"#VALUE!"}},"uF"]
[22,0,0,0,0,0,0,{"$error":"#VALUE!"},0,0,{"$error":"#VALUE!"},{"$error":"#VALUE!"},{"$error":"#VALUE!"},{"$error":"#VALUE!"},null,null,"Rdamp_AEF",{"$f":"'Variable Management'!B296","v":{"$error":"#VALUE!"}},{"$f":"IF(R26=\"OPEN\",\"OPEN\",IF(R26>(INT(0.5+100*POWER(10,IF(96*(LOG(R26)-INT(LOG(R26)))-ROUND(96*(LOG(R26)-INT(LOG(R26))),0)<0,ROUND(96*(LOG(R26)-INT(LOG(R26))),0)-1,ROUND(96*(LOG(R26)-INT(LOG(R26))),0))/96))*POWER(10,INT(LOG(R26))-2)+INT(0.5+100*POWER(10,(IF(96*(LOG(R26)-INT(LOG(R26)))-ROUND(96*(LOG(R26)-INT(LOG(R26))),0)<0,ROUND(96*(LOG(R26)-INT(LOG(R26))),0)-1,ROUND(96*(LOG(R26)-INT(LOG(R26))),0))+1)/96))*POWER(10,INT(LOG(R26))-2))/2,INT(0.5+100*POWER(10,(IF(96*(LOG(R26)-INT(LOG(R26)))-ROUND(96*(LOG(R26)-INT(LOG(R26))),0)<0,ROUND(96*(LOG(R26)-INT(LOG(R26))),0)-1,ROUND(96*(LOG(R26)-INT(LOG(R26))),0))+1)/96))*POWER(10,INT(LOG(R26))-2),INT(0.5+100*POWER(10,IF(96*(LOG(R26)-INT(LOG(R26)))-ROUND(96*(LOG(R26)-INT(LOG(R26))),0)<0,ROUND(96*(LOG(R26)-INT(LOG(R26))),0)-1,ROUND(96*(LOG(R26)-INT(LOG(R26))),0))/96))*POWER(10,INT(LOG(R26))-2)))","v":{"$error":"#VALUE!"}},"Ω"]
[27,0,0,0,0,0,0,{"$error":"#VALUE!"},0,0,{"$error":"#VALUE!"},{"$error":"#VALUE!"},{"$f":"IF(IF((M$3*10^12-$A28)*(M$3*10^12-$A27)*-1<0,0,1)*IF(ABS(M$3*10^12-$A28)>(M$3*10^12-$A27),$A27,$A28)=M28,0,IF((M$3*10^12-$A28)*(M$3*10^12-$A27)*-1<0,0,1)*IF(ABS(M$3*10^12-$A28)>(M$3*10^12-$A27),$A27,$A28))","v":{"$error":"#VALUE!"}},{"$error":"#VALUE!"},null,null,"Rdamp_Passive",{"$f":"SQRT(L_infilterStd/K4)","v":{"$error":"#VALUE!"}},{"$f":"IF(R27=\"OPEN\",\"OPEN\",IF(R27>(INT(0.5+100*POWER(10,IF(96*(LOG(R27)-INT(LOG(R27)))-ROUND(96*(LOG(R27)-INT(LOG(R27))),0)<0,ROUND(96*(LOG(R27)-INT(LOG(R27))),0)-1,ROUND(96*(LOG(R27)-INT(LOG(R27))),0))/96))*POWER(10,INT(LOG(R27))-2)+INT(0.5+100*POWER(10,(IF(96*(LOG(R27)-INT(LOG(R27)))-ROUND(96*(LOG(R27)-INT(LOG(R27))),0)<0,ROUND(96*(LOG(R27)-INT(LOG(R27))),0)-1,ROUND(96*(LOG(R27)-INT(LOG(R27))),0))+1)/96))*POWER(10,INT(LOG(R27))-2))/2,INT(0.5+100*POWER(10,(IF(96*(LOG(R27)-INT(LOG(R27)))-ROUND(96*(LOG(R27)-INT(LOG(R27))),0)<0,ROUND(96*(LOG(R27)-INT(LOG(R27))),0)-1,ROUND(96*(LOG(R27)-INT(LOG(R27))),0))+1)/96))*POWER(10,INT(LOG(R27))-2),INT(0.5+100*POWER(10,IF(96*(LOG(R27)-INT(LOG(R27)))-ROUND(96*(LOG(R27)-INT(LOG(R27))),0)<0,ROUND(96*(LOG(R27)-INT(LOG(R27))),0)-1,ROUND(96*(LOG(R27)-INT(LOG(R27))),0))/96))*POWER(10,INT(LOG(R27))-2)))","v":{"$error":"#VALUE!"}},"Ω"]
[33,0,0,0,0,0,0,{"$error":"#VALUE!"},0,0,{"$error":"#VALUE!"},{"$error":"#VALUE!"},{"$error":"#VALUE!"},{"$error":"#VALUE!"},null,null,"Cdamp_Passive",{"$f":"L4","v":{"$error":"#VALUE!"}},{"$f":"R28*1000000","v":{"$error":"#VALUE!"}},"uF"]
[39,0,0,0,0,0,0,{"$error":"#VALUE!"},0,0,{"$error":"#VALUE!"},{"$error":"#VALUE!"},{"$error":"#VALUE!"},{"$error":"#VALUE!"}]
[47,0,0,0,0,0,0,{"$error":"#VALUE!"},0,0,{"$error":"#VALUE!"},{"$error":"#VALUE!"},{"$error":"#VALUE!"},{"$error":"#VALUE!"}]
[56,0,0,0,0,0,0,{"$error":"#VALUE!"},0,0,{"$error":"#VALUE!"},{"$error":"#VALUE!"},{"$error":"#VALUE!"},{"$error":"#VALUE!"}]
[68,0,0,0,0,0,0,{"$error":"#VALUE!"},0,0,{"$error":"#VALUE!"},{"$error":"#VALUE!"},{"$error":"#VALUE!"},{"$error":"#VALUE!"},null,null,"Rc1",{"$f":"S7/1000&\" kΩ\"","v":"14,7 kΩ"},{"$f":"S7/1000","v":14.7},"kΩ"]
[82,0,0,0,0,0,0,{"$error":"#VALUE!"},0,0,{"$error":"#VALUE!"},{"$error":"#VALUE!"},{"$error":"#VALUE!"},{"$error":"#VALUE!"},null,null,"Cc1",{"$f":"C4*1000000000&\" nF\"","v":"1,8 nF"},{"$f":"C4*1000000000","v":1.8},"nF"]
[{"$f":"A22*10","v":100},0,0,0,0,0,0,{"$error":"#VALUE!"},0,0,{"$error":"#VALUE!"},{"$error":"#VALUE!"},{"$error":"#VALUE!"},{"$error":"#VALUE!"},null,null,"Cc2",{"$f":"D4*1000000000000&\" pF\"","v":"220 pF"},{"$f":"D4*1000000000000","v":220},"pF"]
[{"$f":"A23*10","v":120},0,0,0,0,0,0,{"$error":"#VALUE!"},0,0,{"$error":"#VALUE!"},{"$error":"#VALUE!"},{"$error":"#VALUE!"},{"$error":"#VALUE!"}]
[150,0,0,0,0,0,0,{"$error":"#VALUE!"},0,0,{"$error":"#VALUE!"},{"$error":"#VALUE!"},{"$error":"#VALUE!"},{"$error":"#VALUE!"},null,null,"Rc2",{"$f":"S8/1000&\" kΩ\"","v":{"$error":"#NUM!"}},{"$f":"S8/1000","v":{"$error":"#NUM!"}},"kΩ"]
[180,0,0,0,0,0,0,{"$error":"#VALUE!"},0,0,{"$error":"#VALUE!"},{"$error":"#VALUE!"},{"$error":"#VALUE!"},{"$error":"#VALUE!"},null,null,"Cc3",{"$f":"I4*1000000000&\" nF\"","v":"0 nF"},{"$f":"I4*1000000000","v":0},"nF"]
[220,0,0,220,0,0,0,{"$error":"#VALUE!"},0,0,{"$error":"#VALUE!"},{"$error":"#VALUE!"},{"$error":"#VALUE!"},{"$error":"#VALUE!"},null,null,"Cc4",{"$f":"J4*1000000000000&\" pF\"","v":"0 pF"},{"$f":"J4*1000000000000","v":0},"pF"]
[270,0,{"$f":"IF(IF((C$3*10^12-$A40)*(C$3*10^12-$A39)*-1<0,0,1)*IF(ABS(C$3*10^12-$A40)>(C$3*10^12-$A39),$A39,$A40)=C40,0,IF((C$3*10^12-$A40)*(C$3*10^12-$A39)*-1<0,0,1)*IF(ABS(C$3*10^12-$A40)>(C$3*10^12-$A39),$A39,$A40))","v":0},0,0,0,0,{"$error":"#VALUE!"},0,0,{"$error":"#VALUE!"},{"$error":"#VALUE!"},{"$error":"#VALUE!"},{"$error":"#VALUE!"}]
[330,0,0,0,0,0,0,{"$error":"#VALUE!"},0,0,{"$error":"#VALUE!"},{"$error":"#VALUE!"},{"$error":"#VALUE!"},{"$error":"#VALUE!"},null,null,"Rent",{"$f":"'Variable Management'!B186/1000","v":99.999999999999986},{"$f":"IF(R40>(INT(0.5+100*POWER(10,IF(96*(LOG(R40)-INT(LOG(R40)))-ROUND(96*(LOG(R40)-INT(LOG(R40))),0)<0,ROUND(96*(LOG(R40)-INT(LOG(R40))),0)-1,ROUND(96*(LOG(R40)-INT(LOG(R40))),0))/96))*POWER(10,INT(LOG(R40))-2)+INT(0.5+100*POWER(10,(IF(96*(LOG(R40)-INT(LOG(R40)))-ROUND(96*(LOG(R40)-INT(LOG(R40))),0)<0,ROUND(96*(LOG(R40)-INT(LOG(R40))),0)-1,ROUND(96*(LOG(R40)-INT(LOG(R40))),0))+1)/96))*POWER(10,INT(LOG(R40))-2))/2,INT(0.5+100*POWER(10,(IF(96*(LOG(R40)-INT(LOG(R40)))-ROUND(96*(LOG(R40)-INT(LOG(R40))),0)<0,ROUND(96*(LOG(R40)-INT(LOG(R40))),0)-1,ROUND(96*(LOG(R40)-INT(LOG(R40))),0))+1)/96))*POWER(10,INT(LOG(R40))-2),INT(0.5+100*POWER(10,IF(96*(LOG(R40)-INT(LOG(R40)))-ROUND(96*(LOG(R40)-INT(LOG(R40))),0)<0,ROUND(96*(LOG(R40)-INT(LOG(R40))),0)-1,ROUND(96*(LOG(R40)-INT(LOG(R40))),0))/96))*POWER(10,INT(LOG(R40))-2))","v":100},"kΩ"]
[390,0,0,0,0,0,0,{"$error":"#VALUE!"},0,0,{"$error":"#VALUE!"},{"$error":"#VALUE!"},{"$error":"#VALUE!"},{"$error":"#VALUE!"},null,null,"Renb",{"$f":"'Variable Management'!B187/1000","v":9.0909090909090899},{"$f":"IF(R41>(INT(0.5+100*POWER(10,IF(96*(LOG(R41)-INT(LOG(R41)))-ROUND(96*(LOG(R41)-INT(LOG(R41))),0)<0,ROUND(96*(LOG(R41)-INT(LOG(R41))),0)-1,ROUND(96*(LOG(R41)-INT(LOG(R41))),0))/96))*POWER(10,INT(LOG(R41))-2)+INT(0.5+100*POWER(10,(IF(96*(LOG(R41)-INT(LOG(R41)))-ROUND(96*(LOG(R41)-INT(LOG(R41))),0)<0,ROUND(96*(LOG(R41)-INT(LOG(R41))),0)-1,ROUND(96*(LOG(R41)-INT(LOG(R41))),0))+1)/96))*POWER(10,INT(LOG(R41))-2))/2,INT(0.5+100*POWER(10,(IF(96*(LOG(R41)-INT(LOG(R41)))-ROUND(96*(LOG(R41)-INT(LOG(R41))),0)<0,ROUND(96*(LOG(R41)-INT(LOG(R41))),0)-1,ROUND(96*(LOG(R41)-INT(LOG(R41))),0))+1)/96))*POWER(10,INT(LOG(R41))-2),INT(0.5+100*POWER(10,IF(96*(LOG(R41)-INT(LOG(R41)))-ROUND(96*(LOG(R41)-INT(LOG(R41))),0)<0,ROUND(96*(LOG(R41)-INT(LOG(R41))),0)-1,ROUND(96*(LOG(R41)-INT(LOG(R41))),0))/96))*POWER(10,INT(LOG(R41))-2))","v":9.09},"kΩ"]
[470,0,0,0,0,0,0,{"$error":"#VALUE!"},0,0,{"$error":"#VALUE!"},{"$error":"#VALUE!"},{"$error":"#VALUE!"},{"$error":"#VALUE!"}]
[560,0,0,0,0,0,0,{"$error":"#VALUE!"},0,0,{"$error":"#VALUE!"},{"$error":"#VALUE!"},{"$f":"IF(IF((M$3*10^12-$A44)*(M$3*10^12-$A43)*-1<0,0,1)*IF(ABS(M$3*10^12-$A44)>(M$3*10^12-$A43),$A43,$A44)=M44,0,IF((M$3*10^12-$A44)*(M$3*10^12-$A43)*-1<0,0,1)*IF(ABS(M$3*10^12-$A44)>(M$3*10^12-$A43),$A43,$A44))","v":{"$error":"#VALUE!"}},{"$error":"#VALUE!"}]
[680,0,0,0,0,0,0,{"$error":"#VALUE!"},0,0,{"$error":"#VALUE!"},{"$error":"#VALUE!"},{"$error":"#VALUE!"},{"$error":"#VALUE!"}]
[{"$f":"A33*10","v":820},0,0,0,0,0,0,{"$error":"#VALUE!"},0,0,{"$error":"#VALUE!"},{"$error":"#VALUE!"},{"$error":"#VALUE!"},{"$error":"#VALUE!"}]
[1000,0,0,0,0,0,0,{"$error":"#VALUE!"},0,0,{"$error":"#VALUE!"},{"$error":"#VALUE!"},{"$error":"#VALUE!"},{"$error":"#VALUE!"}]
[1200,0,0,0,0,0,0,{"$error":"#VALUE!"},0,0,{"$error":"#VALUE!"},{"$error":"#VALUE!"},{"$error":"#VALUE!"},{"$error":"#VALUE!"}]
[1500,0,1800,0,0,0,0,{"$error":"#VALUE!"},0,0,{"$error":"#VALUE!"},{"$error":"#VALUE!"},{"$error":"#VALUE!"},{"$error":"#VALUE!"}]
[1800,0,0,0,0,0,0,{"$error":"#VALUE!"},0,0,{"$error":"#VALUE!"},{"$error":"#VALUE!"},{"$error":"#VALUE!"},{"$error":"#VALUE!"}]
[2200,0,0,0,0,0,0,{"$error":"#VALUE!"},0,0,{"$error":"#VALUE!"},{"$error":"#VALUE!"},{"$error":"#VALUE!"},{"$error":"#VALUE!"}]
[2700,0,0,0,0,0,0,{"$error":"#VALUE!"},0,0,{"$error":"#VALUE!"},{"$error":"#VALUE!"},{"$error":"#VALUE!"},{"$error":"#VALUE!"}]
[3300,0,0,0,0,0,0,{"$error":"#VALUE!"},0,0,{"$error":"#VALUE!"},{"$error":"#VALUE!"},{"$error":"#VALUE!"},{"$error":"#VALUE!"}]
[3900,0,0,0,0,0,0,{"$error":"#VALUE!"},0,0,{"$error":"#VALUE!"},{"$error":"#VALUE!"},{"$error":"#VALUE!"},{"$error":"#VALUE!"}]
[4700,0,0,0,0,0,0,{"$error":"#VALUE!"},0,0,{"$error":"#VALUE!"},{"$error":"#VALUE!"},{"$error":"#VALUE!"},{"$error":"#VALUE!"}]
[5600,0,0,0,0,0,0,{"$error":"#VALUE!"},0,0,{"$error":"#VALUE!"},{"$error":"#VALUE!"},{"$error":"#VALUE!"},{"$error":"#VALUE!"}]
[6800,0,0,0,0,0,0,{"$error":"#VALUE!"},0,0,{"$error":"#VALUE!"},{"$error":"#VALUE!"},{"$error":"#VALUE!"},{"$error":"#VALUE!"}]
[8200,0,0,0,0,0,0,{"$error":"#VALUE!"},0,0,{"$error":"#VALUE!"},{"$error":"#VALUE!"},{"$error":"#VALUE!"},{"$error":"#VALUE!"}]
[10000,0,0,0,0,0,0,{"$error":"#VALUE!"},0,0,{"$error":"#VALUE!"},{"$error":"#VALUE!"},{"$error":"#VALUE!"},{"$error":"#VALUE!"}]
[12000,0,0,0,0,0,0,{"$error":"#VALUE!"},0,0,{"$error":"#VALUE!"},{"$error":"#VALUE!"},{"$f":"IF(IF((M$3*10^12-$A60)*(M$3*10^12-$A59)*-1<0,0,1)*IF(ABS(M$3*10^12-$A60)>(M$3*10^12-$A59),$A59,$A60)=M60,0,IF((M$3*10^12-$A60)*(M$3*10^12-$A59)*-1<0,0,1)*IF(ABS(M$3*10^12-$A60)>(M$3*10^12-$A59),$A59,$A60))","v":{"$error":"#VALUE!"}},{"$error":"#VALUE!"}]
[15000,0,0,0,0,0,0,{"$error":"#VALUE!"},0,0,{"$error":"#VALUE!"},{"$error":"#VALUE!"},{"$error":"#VALUE!"},{"$error":"#VALUE!"}]
[18000,0,0,0,0,0,0,{"$error":"#VALUE!"},0,0,{"$error":"#VALUE!"},{"$error":"#VALUE!"},{"$error":"#VALUE!"},{"$error":"#VALUE!"}]
[22000,0,0,0,0,0,0,{"$error":"#VALUE!"},0,0,{"$error":"#VALUE!"},{"$error":"#VALUE!"},{"$error":"#VALUE!"},{"$error":"#VALUE!"}]
[27000,0,0,0,0,0,0,{"$error":"#VALUE!"},0,0,{"$error":"#VALUE!"},{"$error":"#VALUE!"},{"$error":"#VALUE!"},{"$error":"#VALUE!"}]
[33000,0,0,0,0,0,0,{"$error":"#VALUE!"},0,0,{"$error":"#VALUE!"},{"$error":"#VALUE!"},{"$error":"#VALUE!"},{"$error":"#VALUE!"}]
[39000,0,0,0,0,0,0,{"$error":"#VALUE!"},0,0,{"$error":"#VALUE!"},{"$error":"#VALUE!"},{"$error":"#VALUE!"},{"$error":"#VALUE!"}]
[47000,0,0,0,0,0,0,{"$error":"#VALUE!"},0,0,{"$error":"#VALUE!"},{"$error":"#VALUE!"},{"$error":"#VALUE!"},{"$error":"#VALUE!"}]
[56000,0,0,0,0,0,0,{"$error":"#VALUE!"},0,0,{"$error":"#VALUE!"},{"$error":"#VALUE!"},{"$error":"#VALUE!"},{"$error":"#VALUE!"}]
[68000,0,0,0,0,0,0,{"$error":"#VALUE!"},0,0,{"$error":"#VALUE!"},{"$error":"#VALUE!"},{"$error":"#VALUE!"},{"$error":"#VALUE!"}]
[82000,0,0,0,0,0,0,{"$error":"#VALUE!"},0,{"$f":"IF(IF((J$3*10^12-$A70)*(J$3*10^12-$A69)*-1<0,0,1)*IF(ABS(J$3*10^12-$A70)>(J$3*10^12-$A69),$A69,$A70)=J70,0,IF((J$3*10^12-$A70)*(J$3*10^12-$A69)*-1<0,0,1)*IF(ABS(J$3*10^12-$A70)>(J$3*10^12-$A69),$A69,$A70))","v":0},{"$error":"#VALUE!"},{"$error":"#VALUE!"},{"$error":"#VALUE!"},{"$error":"#VALUE!"}]
[100000,0,0,{"$f":"IF(IF((D$3*10^12-$A71)*(D$3*10^12-$A70)*-1<0,0,1)*IF(ABS(D$3*10^12-$A71)>(D$3*10^12-$A70),$A70,$A71)=D71,0,IF((D$3*10^12-$A71)*(D$3*10^12-$A70)*-1<0,0,1)*IF(ABS(D$3*10^12-$A71)>(D$3*10^12-$A70),$A70,$A71))","v":0},0,0,0,{"$error":"#VALUE!"},0,0,{"$error":"#VALUE!"},{"$error":"#VALUE!"},{"$error":"#VALUE!"},{"$error":"#VALUE!"}]
[120000,{"$f":"IF(IF((B$3*10^12-$A72)*(B$3*10^12-$A71)*-1<0,0,1)*IF(ABS(B$3*10^12-$A72)>(B$3*10^12-$A71),$A71,$A72)=B72,0,IF((B$3*10^12-$A72)*(B$3*10^12-$A71)*-1<0,0,1)*IF(ABS(B$3*10^12-$A72)>(B$3*10^12-$A71),$A71,$A72))","v":0},{"$f":"IF(IF((C$3*10^12-$A72)*(C$3*10^12-$A71)*-1<0,0,1)*IF(ABS(C$3*10^12-$A72)>(C$3*10^12-$A71),$A71,$A72)=C72,0,IF((C$3*10^12-$A72)*(C$3*10^12-$A71)*-1<0,0,1)*IF(ABS(C$3*10^12-$A72)>(C$3*10^12-$A71),$A71,$A72))","v":0},0,0,{"$f":"IF(IF((F$3*10^12-$A72)*(F$3*10^12-$A71)*-1<0,0,1)*IF(ABS(F$3*10^12-$A72)>(F$3*10^12-$A71),$A71,$A72)=F72,0,IF((F$3*10^12-$A72)*(F$3*10^12-$A71)*-1<0,0,1)*IF(ABS(F$3*10^12-$A72)>(F$3*10^12-$A71),$A71,$A72))","v":0},{"$f":"IF(IF((G$3*10^12-$A72)*(G$3*10^12-$A71)*-1<0,0,1)*IF(ABS(G$3*10^12-$A72)>(G$3*10^12-$A71),$A71,$A72)=G72,0,IF((G$3*10^12-$A72)*(G$3*10^12-$A71)*-1<0,0,1)*IF(ABS(G$3*10^12-$A72)>(G$3*10^12-$A71),$A71,$A72))","v":0},{"$f":"IF(IF((H$3*10^12-$A72)*(H$3*10^12-$A71)*-1<0,0,1)*IF(ABS(H$3*10^12-$A72)>(H$3*10^12-$A71),$A71,$A72)=H72,0,IF((H$3*10^12-$A72)*(H$3*10^12-$A71)*-1<0,0,1)*IF(ABS(H$3*10^12-$A72)>(H$3*10^12-$A71),$A71,$A72))","v":{"$error":"#VALUE!"}},{"$f":"IF(IF((I$3*10^12-$A72)*(I$3*10^12-$A71)*-1<0,0,1)*IF(ABS(I$3*10^12-$A72)>(I$3*10^12-$A71),$A71,$A72)=I72,0,IF((I$3*10^12-$A72)*(I$3*10^12-$A71)*-1<0,0,1)*IF(ABS(I$3*10^12-$A72)>(I$3*10^12-$A71),$A71,$A72))","v":0},0,{"$error":"#VALUE!"},{"$error":"#VALUE!"},{"$error":"#VALUE!"},{"$error":"#VALUE!"}]
[150000,0,0,0,0,0,0,{"$error":"#VALUE!"},0,0,{"$error":"#VALUE!"},{"$error":"#VALUE!"},{"$error":"#VALUE!"},{"$error":"#VALUE!"}]
[180000,0,0,0,0,0,180000,{"$error":"#VALUE!"},0,0,{"$error":"#VALUE!"},{"$error":"#VALUE!"},{"$error":"#VALUE!"},{"$error":"#VALUE!"}]
[220000,0,0,0,0,0,0,{"$error":"#VALUE!"},0,0,{"$error":"#VALUE!"},{"$error":"#VALUE!"},{"$error":"#VALUE!"},{"$error":"#VALUE!"}]
[270000,0,0,0,0,0,0,{"$error":"#VALUE!"},0,0,{"$error":"#VALUE!"},{"$error":"#VALUE!"},{"$error":"#VALUE!"},{"$error":"#VALUE!"}]
[330000,0,0,0,0,0,0,{"$error":"#VALUE!"},0,0,{"$error":"#VALUE!"},{"$error":"#VALUE!"},{"$error":"#VALUE!"},{"$error":"#VALUE!"}]
[390000,0,0,0,0,0,0,{"$error":"#VALUE!"},0,0,{"$error":"#VALUE!"},{"$error":"#VALUE!"},{"$error":"#VALUE!"},{"$error":"#VALUE!"}]
[470000,0,0,0,0,0,0,{"$error":"#VALUE!"},0,0,{"$error":"#VALUE!"},{"$error":"#VALUE!"},{"$error":"#VALUE!"},{"$error":"#VALUE!"}]
[560000,0,0,0,0,0,0,{"$error":"#VALUE!"},0,0,{"$error":"#VALUE!"},{"$error":"#VALUE!"},{"$error":"#VALUE!"},{"$error":"#VALUE!"}]
[680000,0,0,0,0,0,0,{"$error":"#VALUE!"},0,0,{"$error":"#VALUE!"},{"$error":"#VALUE!"},{"$error":"#VALUE!"},{"$error":"#VALUE!"}]
[820000,0,0,0,0,0,0,{"$error":"#VALUE!"},0,0,{"$error":"#VALUE!"},{"$error":"#VALUE!"},{"$error":"#VALUE!"},{"$error":"#VALUE!"}]
[1000000,0,0,0,0,0,0,{"$error":"#VALUE!"},0,0,{"$error":"#VALUE!"},{"$error":"#VALUE!"},{"$error":"#VALUE!"},{"$error":"#VALUE!"}]
[1200000,0,0,0,0,0,0,{"$error":"#VALUE!"},0,0,{"$error":"#VALUE!"},{"$error":"#VALUE!"},{"$error":"#VALUE!"},{"$error":"#VALUE!"}]
[1500000,0,0,0,0,0,0,{"$error":"#VALUE!"},0,0,{"$error":"#VALUE!"},{"$error":"#VALUE!"},{"$error":"#VALUE!"},{"$error":"#VALUE!"}]
[1800000,0,0,0,0,0,0,{"$error":"#VALUE!"},0,0,{"$error":"#VALUE!"},{"$f":"IF(IF((L$3*10^12-$A86)*(L$3*10^12-$A85)*-1<0,0,1)*IF(ABS(L$3*10^12-$A86)>(L$3*10^12-$A85),$A85,$A86)=L86,0,IF((L$3*10^12-$A86)*(L$3*10^12-$A85)*-1<0,0,1)*IF(ABS(L$3*10^12-$A86)>(L$3*10^12-$A85),$A85,$A86))","v":{"$error":"#VALUE!"}},{"$error":"#VALUE!"},{"$error":"#VALUE!"}]
[2200000,0,0,0,0,0,0,{"$error":"#VALUE!"},0,0,{"$error":"#VALUE!"},{"$error":"#VALUE!"},{"$error":"#VALUE!"},{"$error":"#VALUE!"}]
[2700000,0,0,0,0,0,0,{"$error":"#VALUE!"},0,0,{"$error":"#VALUE!"},{"$error":"#VALUE!"},{"$error":"#VALUE!"},{"$error":"#VALUE!"}]
[3300000,0,0,0,0,0,0,{"$error":"#VALUE!"},0,0,{"$error":"#VALUE!"},{"$error":"#VALUE!"},{"$error":"#VALUE!"},{"$error":"#VALUE!"}]
[3900000,0,0,0,0,0,0,{"$error":"#VALUE!"},0,0,{"$error":"#VALUE!"},{"$error":"#VALUE!"},{"$error":"#VALUE!"},{"$error":"#VALUE!"}]
[4700000,0,0,0,0,0,0,{"$error":"#VALUE!"},0,0,{"$error":"#VALUE!"},{"$error":"#VALUE!"},{"$error":"#VALUE!"},{"$error":"#VALUE!"}]
[5600000,0,0,0,0,0,0,{"$error":"#VALUE!"},0,0,{"$error":"#VALUE!"},{"$error":"#VALUE!"},{"$error":"#VALUE!"},{"$error":"#VALUE!"}]
[6800000,0,0,0,0,0,0,{"$error":"#VALUE!"},0,0,{"$error":"#VALUE!"},{"$error":"#VALUE!"},{"$error":"#VALUE!"},{"$error":"#VALUE!"}]
[8200000,0,0,0,0,0,0,{"$error":"#VALUE!"},0,0,{"$error":"#VALUE!"},{"$error":"#VALUE!"},{"$error":"#VALUE!"},{"$error":"#VALUE!"}]
[10000000,0,0,0,0,0,0,{"$error":"#VALUE!"},0,0,{"$error":"#VALUE!"},{"$error":"#VALUE!"},{"$error":"#VALUE!"},{"$error":"#VALUE!"}]
[12000000,0,0,0,0,0,0,{"$error":"#VALUE!"},0,0,{"$error":"#VALUE!"},{"$error":"#VALUE!"},{"$error":"#VALUE!"},{"$error":"#VALUE!"}]
[15000000,0,0,0,0,0,0,{"$error":"#VALUE!"},0,0,{"$error":"#VALUE!"},{"$error":"#VALUE!"},{"$error":"#VALUE!"},{"$error":"#VALUE!"}]
[18000000,0,0,0,0,0,0,{"$error":"#VALUE!"},0,0,{"$error":"#VALUE!"},{"$error":"#VALUE!"},{"$error":"#VALUE!"},{"$error":"#VALUE!"}]
[22000000,0,0,0,0,0,0,{"$error":"#VALUE!"},0,0,{"$error":"#VALUE!"},{"$error":"#VALUE!"},{"$error":"#VALUE!"},{"$error":"#VALUE!"}]
[{"$f":"A87*10","v":27000000},0,0,0,0,0,0,{"$error":"#VALUE!"},0,0,{"$error":"#VALUE!"},{"$error":"#VALUE!"},{"$error":"#VALUE!"},{"$error":"#VALUE!"}]
[33000000,0,0,0,0,0,0,{"$error":"#VALUE!"},0,0,{"$error":"#VALUE!"},{"$error":"#VALUE!"},{"$error":"#VALUE!"},{"$error":"#VALUE!"}]
[39000000,0,0,0,0,0,0,{"$error":"#VALUE!"},0,0,{"$error":"#VALUE!"},{"$error":"#VALUE!"},{"$error":"#VALUE!"},{"$error":"#VALUE!"}]
[47000000,0,0,0,0,0,0,{"$error":"#VALUE!"},0,0,{"$error":"#VALUE!"},{"$error":"#VALUE!"},{"$error":"#VALUE!"},{"$error":"#VALUE!"}]
[56000000,0,0,0,56000000,{"$f":"IF(IF((F$3*10^12-$A104)*(F$3*10^12-$A103)*-1<0,0,1)*IF(ABS(F$3*10^12-$A104)>(F$3*10^12-$A103),$A103,$A104)=F104,0,IF((F$3*10^12-$A104)*(F$3*10^12-$A103)*-1<0,0,1)*IF(ABS(F$3*10^12-$A104)>(F$3*10^12-$A103),$A103,$A104))","v":0},{"$f":"IF(IF((G$3*10^12-$A104)*(G$3*10^12-$A103)*-1<0,0,1)*IF(ABS(G$3*10^12-$A104)>(G$3*10^12-$A103),$A103,$A104)=G104,0,IF((G$3*10^12-$A104)*(G$3*10^12-$A103)*-1<0,0,1)*IF(ABS(G$3*10^12-$A104)>(G$3*10^12-$A103),$A103,$A104))","v":0},{"$f":"IF(IF((H$3*10^12-$A104)*(H$3*10^12-$A103)*-1<0,0,1)*IF(ABS(H$3*10^12-$A104)>(H$3*10^12-$A103),$A103,$A104)=H104,0,IF((H$3*10^12-$A104)*(H$3*10^12-$A103)*-1<0,0,1)*IF(ABS(H$3*10^12-$A104)>(H$3*10^12-$A103),$A103,$A104))","v":{"$error":"#VALUE!"}},{"$f":"IF(IF((I$3*10^12-$A104)*(I$3*10^12-$A103)*-1<0,0,1)*IF(ABS(I$3*10^12-$A104)>(I$3*10^12-$A103),$A103,$A104)=I104,0,IF((I$3*10^12-$A104)*(I$3*10^12-$A103)*-1<0,0,1)*IF(ABS(I$3*10^12-$A104)>(I$3*10^12-$A103),$A103,$A104))","v":0},0,{"$error":"#VALUE!"},{"$error":"#VALUE!"},{"$error":"#VALUE!"},{"$error":"#VALUE!"}]
[68000000,0,0,0,0,0,0,{"$error":"#VALUE!"},0,0,{"$error":"#VALUE!"},{"$error":"#VALUE!"},{"$error":"#VALUE!"},{"$error":"#VALUE!"}]
[82000000,0,0,0,0,0,0,{"$error":"#VALUE!"},0,0,{"$error":"#VALUE!"},{"$error":"#VALUE!"},{"$error":"#VALUE!"},{"$error":"#VALUE!"}]
[100000000,0,0,0,0,0,0,{"$error":"#VALUE!"},0,0,{"$error":"#VALUE!"},{"$error":"#VALUE!"},{"$error":"#VALUE!"},{"$error":"#VALUE!"}]
[120000000,0,0,0,0,120000000,0,{"$error":"#VALUE!"},0,0,{"$error":"#VALUE!"},{"$error":"#VALUE!"},{"$error":"#VALUE!"},{"$error":"#VALUE!"}]
[150000000,0,0,0,0,0,0,{"$error":"#VALUE!"},0,0,{"$error":"#VALUE!"},{"$error":"#VALUE!"},{"$error":"#VALUE!"},{"$error":"#VALUE!"}]
[180000000,0,0,0,0,0,0,{"$error":"#VALUE!"},0,0,{"$error":"#VALUE!"},{"$error":"#VALUE!"},{"$error":"#VALUE!"},{"$error":"#VALUE!"}]
[220000000,0,0,0,0,0,0,{"$error":"#VALUE!"},0,0,{"$error":"#VALUE!"},{"$error":"#VALUE!"},{"$error":"#VALUE!"},{"$error":"#VALUE!"}]
[270000000,0,0,0,0,0,0,{"$error":"#VALUE!"},0,0,{"$error":"#VALUE!"},{"$error":"#VALUE!"},{"$error":"#VALUE!"},{"$error":"#VALUE!"}]
[330000000,0,0,0,0,0,0,{"$error":"#VALUE!"},0,0,{"$error":"#VALUE!"},{"$error":"#VALUE!"},{"$error":"#VALUE!"},{"$error":"#VALUE!"}]
[390000000,0,0,0,0,0,0,{"$error":"#VALUE!"},0,0,{"$error":"#VALUE!"},{"$error":"#VALUE!"},{"$error":"#VALUE!"},{"$error":"#VALUE!"}]
[470000000,0,0,0,0,0,0,{"$error":"#VALUE!"},0,0,{"$error":"#VALUE!"},{"$error":"#VALUE!"},{"$error":"#VALUE!"},{"$error":"#VALUE!"}]
[560000000,0,0,0,0,0,0,{"$error":"#VALUE!"},0,0,{"$error":"#VALUE!"},{"$error":"#VALUE!"},{"$error":"#VALUE!"},{"$error":"#VALUE!"}]
[680000000,0,0,0,0,0,0,{"$error":"#VALUE!"},0,0,{"$error":"#VALUE!"},{"$error":"#VALUE!"},{"$error":"#VALUE!"},{"$error":"#VALUE!"}]
[820000000,0,0,0,0,0,0,{"$error":"#VALUE!"},0,0,{"$error":"#VALUE!"},{"$error":"#VALUE!"},{"$error":"#VALUE!"},{"$error":"#VALUE!"}]
[1000000000,0,0,0,0,0,0,{"$error":"#VALUE!"},0,0,{"$error":"#VALUE!"},{"$error":"#VALUE!"},{"$error":"#VALUE!"},{"$error":"#VALUE!"}]
[1200000000,0,0,0,0,0,0,{"$error":"#VALUE!"},0,0,{"$error":"#VALUE!"},{"$error":"#VALUE!"},{"$error":"#VALUE!"},{"$error":"#VALUE!"}]
[1500000000,0,0,0,0,0,0,{"$error":"#VALUE!"},0,0,{"$error":"#VALUE!"},{"$error":"#VALUE!"},{"$error":"#VALUE!"},{"$error":"#VALUE!"}]
[1800000000,0,0,0,0,0,0,{"$error":"#VALUE!"},0,0,{"$error":"#VALUE!"},{"$error":"#VALUE!"},{"$error":"#VALUE!"},{"$error":"#VALUE!"}]
[2200000000,0,0,0,0,0,0,{"$error":"#VALUE!"},0,0,{"$error":"#VALUE!"},{"$error":"#VALUE!"},{"$error":"#VALUE!"},{"$error":"#VALUE!"}]
[2700000000,0,0,0,0,0,0,{"$error":"#VALUE!"},0,0,{"$error":"#VALUE!"},{"$error":"#VALUE!"},{"$error":"#VALUE!"},{"$error":"#VALUE!"}]
[3300000000,0,0,0,0,0,0,{"$error":"#VALUE!"},0,0,{"$error":"#VALUE!"},{"$error":"#VALUE!"},{"$error":"#VALUE!"},{"$error":"#VALUE!"}]
[3900000000,0,0,0,0,0,0,{"$error":"#VALUE!"},0,0,{"$error":"#VALUE!"},{"$error":"#VALUE!"},{"$error":"#VALUE!"},{"$error":"#VALUE!"}]
[4700000000,0,0,0,0,0,0,{"$error":"#VALUE!"},0,0,{"$error":"#VALUE!"},{"$error":"#VALUE!"},{"$error":"#VALUE!"},{"$error":"#VALUE!"}]
[5600000000,0,0,0,0,0,0,{"$error":"#VALUE!"},0,0,{"$error":"#VALUE!"},{"$error":"#VALUE!"},{"$error":"#VALUE!"},{"$error":"#VALUE!"}]
[6800000000,0,0,0,0,0,0,{"$error":"#VALUE!"},0,0,{"$error":"#VALUE!"},{"$error":"#VALUE!"},{"$error":"#VALUE!"},{"$error":"#VALUE!"}]
[8200000000,0,0,0,0,0,0,{"$error":"#VALUE!"},0,0,{"$error":"#VALUE!"},{"$error":"#VALUE!"},{"$error":"#VALUE!"},{"$error":"#VALUE!"}]
[10000000000,0,0,0,0,0,0,{"$error":"#VALUE!"},0,0,{"$error":"#VALUE!"},{"$error":"#VALUE!"},{"$error":"#VALUE!"},{"$error":"#VALUE!"}]
[12000000000,0,0,0,0,0,0,{"$error":"#VALUE!"},0,0,{"$error":"#VALUE!"},{"$error":"#VALUE!"},{"$error":"#VALUE!"},{"$error":"#VALUE!"}]
[15000000000,0,0,0,0,0,0,{"$error":"#VALUE!"},0,0,{"$f":"IF(IF((K$3*10^12-$A133)*(K$3*10^12-$A132)*-1<0,0,1)*IF(ABS(K$3*10^12-$A133)>(K$3*10^12-$A132),$A132,$A133)=K133,0,IF((K$3*10^12-$A133)*(K$3*10^12-$A132)*-1<0,0,1)*IF(ABS(K$3*10^12-$A133)>(K$3*10^12-$A132),$A132,$A133))","v":{"$error":"#VALUE!"}},{"$f":"IF(IF((L$3*10^12-$A133)*(L$3*10^12-$A132)*-1<0,0,1)*IF(ABS(L$3*10^12-$A133)>(L$3*10^12-$A132),$A132,$A133)=L133,0,IF((L$3*10^12-$A133)*(L$3*10^12-$A132)*-1<0,0,1)*IF(ABS(L$3*10^12-$A133)>(L$3*10^12-$A132),$A132,$A133))","v":{"$error":"#VALUE!"}},{"$error":"#VALUE!"},{"$error":"#VALUE!"}]
[18000000000,0,0,0,0,0,0,{"$error":"#VALUE!"},0,{"$f":"IF(IF((J$3*10^12-$A134)*(J$3*10^12-$A133)*-1<0,0,1)*IF(ABS(J$3*10^12-$A134)>(J$3*10^12-$A133),$A133,$A134)=J134,0,IF((J$3*10^12-$A134)*(J$3*10^12-$A133)*-1<0,0,1)*IF(ABS(J$3*10^12-$A134)>(J$3*10^12-$A133),$A133,$A134))","v":0},{"$error":"#VALUE!"},{"$error":"#VALUE!"},{"$f":"IF(IF((M$3*10^12-$A134)*(M$3*10^12-$A133)*-1<0,0,1)*IF(ABS(M$3*10^12-$A134)>(M$3*10^12-$A133),$A133,$A134)=M134,0,IF((M$3*10^12-$A134)*(M$3*10^12-$A133)*-1<0,0,1)*IF(ABS(M$3*10^12-$A134)>(M$3*10^12-$A133),$A133,$A134))","v":{"$error":"#VALUE!"}},{"$f":"IF(IF((N$3*10^12-$A134)*(N$3*10^12-$A133)*-1<0,0,1)*IF(ABS(N$3*10^12-$A134)>(N$3*10^12-$A133),$A133,$A134)=N134,0,IF((N$3*10^12-$A134)*(N$3*10^12-$A133)*-1<0,0,1)*IF(ABS(N$3*10^12-$A134)>(N$3*10^12-$A133),$A133,$A134))","v":{"$error":"#VALUE!"}}]
[22000000000,0,0,0,{"$f":"IF(IF((E$3*10^12-$A135)*(E$3*10^12-$A134)*-1<0,0,1)*IF(ABS(E$3*10^12-$A135)>(E$3*10^12-$A134),$A134,$A135)=E135,0,IF((E$3*10^12-$A135)*(E$3*10^12-$A134)*-1<0,0,1)*IF(ABS(E$3*10^12-$A135)>(E$3*10^12-$A134),$A134,$A135))","v":0},0,0,{"$error":"#VALUE!"},0,0,{"$error":"#VALUE!"},{"$error":"#VALUE!"},{"$f":"IF(IF((M$3*10^12-$A135)*(M$3*10^12-$A134)*-1<0,0,1)*IF(ABS(M$3*10^12-$A135)>(M$3*10^12-$A134),$A134,$A135)=M135,0,IF((M$3*10^12-$A135)*(M$3*10^12-$A134)*-1<0,0,1)*IF(ABS(M$3*10^12-$A135)>(M$3*10^12-$A134),$A134,$A135))","v":{"$error":"#VALUE!"}},{"$f":"IF(IF((N$3*10^12-$A135)*(N$3*10^12-$A134)*-1<0,0,1)*IF(ABS(N$3*10^12-$A135)>(N$3*10^12-$A134),$A134,$A135)=N135,0,IF((N$3*10^12-$A135)*(N$3*10^12-$A134)*-1<0,0,1)*IF(ABS(N$3*10^12-$A135)>(N$3*10^12-$A134),$A134,$A135))","v":{"$error":"#VALUE!"}}]
[27000000000,{"$f":"IF(IF((B$3*10^12-$A136)*(B$3*10^12-$A135)*-1<0,0,1)*IF(ABS(B$3*10^12-$A136)>(B$3*10^12-$A135),$A135,$A136)=B136,0,IF((B$3*10^12-$A136)*(B$3*10^12-$A135)*-1<0,0,1)*IF(ABS(B$3*10^12-$A136)>(B$3*10^12-$A135),$A135,$A136))","v":0},{"$f":"IF(IF((C$3*10^12-$A136)*(C$3*10^12-$A135)*-1<0,0,1)*IF(ABS(C$3*10^12-$A136)>(C$3*10^12-$A135),$A135,$A136)=C136,0,IF((C$3*10^12-$A136)*(C$3*10^12-$A135)*-1<0,0,1)*IF(ABS(C$3*10^12-$A136)>(C$3*10^12-$A135),$A135,$A136))","v":0},0,0,0,0,{"$error":"#VALUE!"},0,0,{"$error":"#VALUE!"},{"$error":"#VALUE!"},{"$error":"#VALUE!"},{"$error":"#VALUE!"}]
[33000000000,0,0,0,0,0,0,{"$error":"#VALUE!"},0,0,{"$error":"#VALUE!"},{"$error":"#VALUE!"},{"$error":"#VALUE!"},{"$error":"#VALUE!"}]
[39000000000,0,0,0,0,0,0,{"$error":"#VALUE!"},0,0,{"$error":"#VALUE!"},{"$error":"#VALUE!"},{"$error":"#VALUE!"},{"$error":"#VALUE!"}]
[47000000000,0,0,0,0,0,0,{"$error":"#VALUE!"},0,0,{"$error":"#VALUE!"},{"$error":"#VALUE!"},{"$error":"#VALUE!"},{"$error":"#VALUE!"}]
[56000000000,0,0,0,0,0,0,{"$error":"#VALUE!"},0,0,{"$error":"#VALUE!"},{"$error":"#VALUE!"},{"$error":"#VALUE!"},{"$error":"#VALUE!"}]
[68000000000,0,0,0,0,0,0,{"$error":"#VALUE!"},0,0,{"$error":"#VALUE!"},{"$error":"#VALUE!"},{"$error":"#VALUE!"},{"$error":"#VALUE!"}]
[82000000000,0,0,0,0,0,0,{"$error":"#VALUE!"},0,0,{"$error":"#VALUE!"},{"$error":"#VALUE!"},{"$error":"#VALUE!"},{"$error":"#VALUE!"}]
[100000000000,0,0,0,0,0,0,{"$error":"#VALUE!"},0,0,{"$error":"#VALUE!"},{"$error":"#VALUE!"},{"$error":"#VALUE!"},{"$error":"#VALUE!"}]
[120000000000,0,0,0,0,0,0,{"$error":"#VALUE!"},0,0,{"$error":"#VALUE!"},{"$error":"#VALUE!"},{"$error":"#VALUE!"},{"$error":"#VALUE!"}]
[150000000000,0,0,0,0,0,0,{"$error":"#VALUE!"},0,0,{"$error":"#VALUE!"},{"$error":"#VALUE!"},{"$error":"#VALUE!"},{"$error":"#VALUE!"}]
[180000000000,0,0,0,0,0,0,{"$error":"#VALUE!"},0,0,{"$error":"#VALUE!"},{"$error":"#VALUE!"},{"$error":"#VALUE!"},{"$error":"#VALUE!"}]
[220000000000,0,0,0,0,0,0,{"$error":"#VALUE!"},0,0,{"$error":"#VALUE!"},{"$error":"#VALUE!"},{"$error":"#VALUE!"},{"$error":"#VALUE!"}]
[270000000000,0,0,0,0,0,0,{"$error":"#VALUE!"},0,0,{"$error":"#VALUE!"},{"$error":"#VALUE!"},{"$error":"#VALUE!"},{"$error":"#VALUE!"}]
[330000000000,0,0,0,0,0,0,{"$error":"#VALUE!"},0,0,{"$error":"#VALUE!"},{"$error":"#VALUE!"},{"$error":"#VALUE!"},{"$error":"#VALUE!"}]
[390000000000,0,0,0,0,0,0,{"$error":"#VALUE!"},0,0,{"$error":"#VALUE!"},{"$error":"#VALUE!"},{"$error":"#VALUE!"},{"$error":"#VALUE!"}]
[470000000000,0,0,0,0,0,0,{"$error":"#VALUE!"},0,0,{"$error":"#VALUE!"},{"$error":"#VALUE!"},{"$error":"#VALUE!"},{"$error":"#VALUE!"}]
[560000000000,0,0,0,0,0,0,{"$error":"#VALUE!"},0,0,{"$error":"#VALUE!"},{"$error":"#VALUE!"},{"$error":"#VALUE!"},{"$error":"#VALUE!"}]
[680000000000,0,0,0,0,0,0,{"$error":"#VALUE!"},0,0,{"$error":"#VALUE!"},{"$error":"#VALUE!"},{"$error":"#VALUE!"},{"$error":"#VALUE!"}]
[820000000000,0,0,0,0,0,0,{"$error":"#VALUE!"},0,0,{"$error":"#VALUE!"},{"$error":"#VALUE!"},{"$error":"#VALUE!"},{"$error":"#VALUE!"}]
[1000000000000,0,0,0,0,0,0,{"$error":"#VALUE!"},0,0,{"$error":"#VALUE!"},{"$error":"#VALUE!"},{"$error":"#VALUE!"},{"$error":"#VALUE!"}]
[1200000000000,0,0,0,0,0,0,{"$error":"#VALUE!"},0,0,{"$error":"#VALUE!"},{"$error":"#VALUE!"},{"$error":"#VALUE!"},{"$error":"#VALUE!"}]
[1500000000000,0,0,0,0,0,0,{"$error":"#VALUE!"},0,0,{"$error":"#VALUE!"},{"$error":"#VALUE!"},{"$error":"#VALUE!"},{"$error":"#VALUE!"}]
[1800000000000,0,0,0,0,0,0,{"$error":"#VALUE!"},0,0,{"$error":"#VALUE!"},{"$error":"#VALUE!"},{"$error":"#VALUE!"},{"$error":"#VALUE!"}]
[2200000000000,0,0,0,0,0,0,{"$error":"#VALUE!"},0,0,{"$error":"#VALUE!"},{"$error":"#VALUE!"},{"$error":"#VALUE!"},{"$error":"#VALUE!"}]
[2700000000000,2700000000000,2700000000000,2700000000000,2700000000000,2700000000000,2700000000000,{"$error":"#VALUE!"},2700000000000,2700000000000,{"$error":"#VALUE!"},{"$error":"#VALUE!"},{"$error":"#VALUE!"},{"$error":"#VALUE!"}]

{"sheet":"Snubber","index":13,"n_rows":6,"n_cols":5,"rows_kept":6,"cut":false,"hidden":true,"merged":[]}
[null,null,"UNITS","STD UNITS"]
["Frequency of Ringing",85,"MHz",{"$f":"B2*1000000","v":85000000},"Hz"]
["SW capacitance",3000,"pF",{"$f":"B3*0.000000000001","v":3E-9},"F"]
["Lpar",{"$f":"1000000000*1/((D2*2*3.14159)^2*D3)","v":1.1686430773614742},"nH",{"$f":"B4/1000000000","v":1.1686430773614743E-9},"H"]
["Csnub",{"$f":"4*B3","v":12000},"pF",{"$f":"B5*0.000000000001","v":1.2E-8},"F"]
["Rsnub",{"$f":"SQRT(D4/D3)","v":0.62413755891936573},"Ω",{"$f":"B6","v":0.62413755891936573},"Ω"]

{"sheet":"Parallel Output Caps","index":14,"n_rows":17,"n_cols":5,"rows_kept":17,"cut":false,"hidden":true,"merged":[]}
[]
[]
[]
["Fsw",{"$f":"Fsw","v":425000}]
[]
["C1",20,"uF",{"$f":"B6/1000000","v":2.0000000000000002E-5},"F"]
["R1",0.5,"mOhms",{"$f":"B7/1000","v":5.0000000000000001E-4},"Ohms"]
[]
["C2",68,"uF",{"$f":"B9/1000000","v":6.7999999999999999E-5},"F"]
["R2",20,"mOhms",{"$f":"B10/1000","v":0.02},"Ohms"]
[]
[]
["I1 ",{"$f":"(D6/(D6+D9))*SQRT((D10*D9*B4)^2+1)/SQRT((((D7+D10)*D6*D9/(D9+D6))*B4)^2+1)","v":0.26015806387044099},"%"]
["I2 ",{"$f":"1-B13","v":0.73984193612955895},"%"]
[]
["I1 ",{"$f":"B13*(Iripple1/(2*SQRT(3)))","v":{"$error":"#NAME?"}},"A"]
["I2 ",{"$f":"B14*(Iripple1/(2*SQRT(3)))","v":{"$error":"#NAME?"}},"A"]